Skip Menu |
 

This queue is for tickets about the ExtUtils-MakeMaker CPAN distribution.

Maintainer(s)

ABURLISON, ANDK, BINGOS, CHORNY, ETHER, ETJ, FLORA, LEONT, MSCHWERN, MSTROUT

Bugs

ID Subject Status Severity Last Updated Broken in Fixed in
117928 don't know how to make test_dynamic on BSD resolved 3 months ago 7.15_01
124465 Version 7.32 is broken when built in perl core resolved 3 months ago 7.33_03
121924 Fails to write Makefile if optional_features are present resolved 3 months ago 7.25_01
7.26
7.27_01
128004 gcc AIX builds broken resolved 3 months ago 7.35_11
124474 MM 7.32 is noisy on STDERR resolved 3 months ago 7.34
121913 does not write own META.* correctly resolved 1 years ago 7.25_01 7.27_01
121918 t/03-xsstatic.t fails on some systems resolved 2 years ago 7.25_02
7.25_03
7.25_04
7.25_05
7.25_06
7.26
7.27_01
7.27_02
7.28
7.29_01
7.29_02
7.30
7.31_01
115302 Test warnings from MM_Unix.pm resolved 2 years ago
116726 ExtUtils::MM_Unix.pm: uninitialized value resolved 2 years ago 7.20
106572 specifying AUTHOR via command-line is broken resolved 3 years ago 7.11_01
7.11_02
7.11_03
7.11_04
7.11_05
7.11_06
7.12
102397 non-deterministic order of files resolved 3 years ago
103281 t/basic.t unicode test fails also on some linux systems resolved 3 years ago 7.05_19 7.11_01
7.11_02
7.11_03
7.11_04
7.11_05
7.11_06
7.12
106808 Wrong empty line in PASTHRU cmd resolved 3 years ago 7.06 7.07_01
7.08
7.10
7.11_01
7.11_02
7.11_03
7.11_04
7.11_05
7.11_06
7.12
103042 Building distmeta target fails but make continues. resolved 3 years ago 6.98
7.04
7.12
104663 Cygwin: do not mess with the image base and do an ephemeral rebase on i686 resolved Important 3 years ago 7.04 7.11_01
7.11_02
7.11_03
7.11_04
7.11_05
7.11_06
7.12
106975 Broken: make testdb TEST_FILE=... resolved 3 years ago 7.11_04
7.11_05
7.11_06
7.12
109962 -o flag missing in cc resolved 3 years ago 7.11_01
7.11_02
7.11_03
101132 [Win32] gmake needs SHELL to be specified. resolved 3 years ago 7.05_05
109423 ExtUtils::MakeMaker won't install on Windows 8 Strawberry Perl 5.18.1 resolved 4 years ago
106927 The recent blib/_eumm/ addition fires too early breaking legitimate dev workflows resolved 4 years ago 7.11_01
102009 Many new fails today, suspect EUMM resolved 4 years ago 7.05_12
7.05_09
7.05_10
7.05_11
7.05_13
102706 Mkbootstrap.t test and thus MakeMaker install fails on latest Cygwin x64 resolved 4 years ago 7.05_16
101489 [PATCH] reduce compiler warnings and stderr noise resolved 4 years ago 7.05_08
100707 t/xs.t test fails on Strawberry Perl 5.16 resolved 4 years ago
68679 dmake on win32 (strawberry) doesn't like escaped CCFLAGS resolved 5 years ago 7.05_06
52877 [Fwd: [Fwd: Re: '()' escaped to '\(\)' is breaking my build]] resolved 5 years ago 7.05_06
6176 more flexible Mkbootstrap resolved Wishlist 5 years ago 7.05_06
3081 PASTHRU doesn't work on Win32 resolved Normal 5 years ago 7.05_06
101205 Generated META.json incorrect on Win 7 resolved Important 5 years ago 7.04
76751 [RT #7742] MakeMaker: handling source files in subdirs resolved Normal 5 years ago 7.05_05
75344 Should warn/fail on an invalid LICENSE value resolved Normal 5 years ago 6.56
6.58
6.59
6.62
7.05_05
98298 Verify license key when generating META files resolved 5 years ago 7.05_05
8530 Discourage use of PM_FILTER resolved Wishlist 5 years ago 7.05_05
14681 makemaker FAQ resolved Unimportant 5 years ago 7.05_05
3050 Have Makefile.PL look for make on Windows and warn otherwise. resolved Wishlist 5 years ago
29061 List form of backticks resolved Wishlist 5 years ago
25882 Prefixify INSTALLSITESCRIPT and INSTALLBIN resolved Normal 5 years ago 6.30
75705 Setting INSTALL_BASE does not work for HTMLDIRs resolved 5 years ago
45732 Ignore INSTALLHTMLDIR if INSTALLHTML[13]DIR are provided resolved Wishlist 5 years ago 6.51_02
45600 INSTALLHTML[13]DIR are not based on $(PREFIX) resolved Critical 5 years ago 6.51_02
37806 Adding support for generating HTML manpages [PATCH] resolved Wishlist 5 years ago
45701 Bug? EU::MM fails if PERL_SRC && not PERL_CORE resolved Normal 5 years ago
45816 Can't install if existing .packlist is not readable resolved Important 5 years ago 7.04
93889 [Win32] dmake warning: Ignoring AUGMAKE meta-target resolved 5 years ago 6.92
20034 Fwd: Problem in "make test" with multiple Makefile.PL's resolved Normal 5 years ago 7.04
55590 Unbalanced { in generated Makefile resolved Important 5 years ago 6.56 7.00
101055 No error checking in "make ci": ci/rcs fail but make exits with zer status resolved Normal 5 years ago 6.98
7.04
7.05_03
100268 t/unicode.t fails if Locale::Encode is not available: Wide character in print resolved 5 years ago 7.02 7.05_03
100275 EUMM 7.02 breaks CCFLAGS handling resolved 5 years ago 7.03_01
7.04
47463 people using PREFIX for bits of installation should work resolved 5 years ago
100159 EUMM 7.00 breaks SREZIC/Tk-804.032.tar.gz resolved 5 years ago 7.00
7.01_08
6.99_10
37836 makemaker fail to build the right DIRFILESEP under win32 affected file MM_Win32.pm (fix proposes too :-D) resolved Important 5 years ago 6.44 7.05_01
39235 Invalid UTF-8 sequence in generated Makefile breaks Solaris 2.10+ resolved Normal 5 years ago 6.44
99785 [PATCH] Windows miniperl compatibility resolved 5 years ago 7.01_02
7.02
92969 Unable to install ExtUtils-MakeMaker v6.88 resolved 5 years ago 7.00
74095 Tell the user their Perl numification is broken resolved Wishlist 5 years ago 6.62
78187 [perl #39055] Patches for 5.8.8 lib/ExtUtils/t failures resolved 5 years ago
29349 Guard against existing MakeMaker environment variables resolved Normal 5 years ago 6.99_07
75758 clean_versions throws version ranges away resolved Important 5 years ago 6.59
6.62
6.63_02
7.05_01
99978 WriteMakefile(test => { TESTS => "foo.t bar.t quux.t" }, ...) is broken resolved 5 years ago 7.01_04 7.01_06
98766 [PATCH] darwin can have libfoo.0.dylib resolved 5 years ago 7.00
98517 Latest dev version space-handling likely breaks MRO::Compat resolved 5 years ago 7.00
96251 Warning "Wide character in print" if AUTHORS contain Unicode resolved 5 years ago 6.98 6.99_07
7.00
99580 get_version rewrite in _08 no longer works under -T resolved Normal 5 years ago 6.99_08
6.99_09
6.99_10
6.99_11
6.99_12
6.99_13
6.99_14
6.99_15
6.99_16
6.99_17
6.99_18
98194 [PATCH] Kid.pm: add system libpath "/system/lib" on Android resolved Normal 5 years ago 6.98
92488 Cyclical dependency resolved Important 5 years ago
11434 library fails to get passed into Makefile on Solaris, but not Darwin resolved Normal 5 years ago 6.25
4322 wish: INSTALLDIRS={perl|site|vendor},arch resolved Wishlist 5 years ago
448 MakeMaker busted when perl is in C:\Program Files resolved Wishlist 5 years ago 5.55_01
49418 [PATCH] Handling spaces in path to perl install dir resolved Normal 5 years ago 6.55_02 6.99_06
28991 [Fwd: Re: [patch] First batch of whitespace patches (ExtUtils::MakeMaker)] resolved Wishlist 5 years ago 6.99_06
12713 Spaces in PREFIX Broken resolved Normal 5 years ago 6.27
15411 MakeMaker cannot handle spaces in perl path resolved Important 5 years ago 6.05
69669 [patch] minimal patch for win paths with spaces resolved 5 years ago 6.58
69815 blib/lib and blib/arch should be absolute for tests resolved Normal 5 years ago 6.58
21432 Evaporate TODO file resolved Wishlist 5 years ago
96038 META_MERGE trouble resolved 5 years ago 6.98
92535 Sync with blead resolved 5 years ago 6.87_04 6.87_05
91540 PREREQ_FATAL not recognized on command line resolved 6 years ago 6.84 6.85_03
6.85_04
91447 Feature request / enhancement in PPD generator code ? resolved 6 years ago 6.85_02
89524 INC-parameter ignored resolved 6 years ago
11470 MakeMaker xs_o section and nmake resolved Normal 6 years ago 6.25_08
9709 A little more verbosity resolved Wishlist 6 years ago 6.25_07 6.84
90780 Avoiding: dmake.exe: ... Warning: -- Macro `BOOTSTRAP' redefined after use resolved 6 years ago 6.84
87302 [PATCH] wrong return precedence in bundled apps resolved 6 years ago 6.82
28992 [Fwd: How to get rid of empty .bs files] resolved Wishlist 6 years ago 6.82
89781 [PATCH] Update XSPROTOARG docs for 1996 onwards resolved 6 years ago 6.82
17041 Sort manification and copying events for perceptive cleanliness resolved Wishlist 6 years ago 6.30_01 6.75_03
7248 Warn on invalid NAME resolved Wishlist 6 years ago 6.21_03 6.78
77029 Support linefeeds in abstract parsing. resolved Wishlist 6 years ago 6.62 6.78
69590 Tests do not work in parallel resolved Wishlist 6 years ago 6.78
48201 ExtUtils::MakeMaker Bug with -Duserelocatableinc resolved 6 years ago 6.55_02
87350 DLEXT not documented resolved 6 years ago
8616 Add NOPACKLIST and NOPERLLOCAL options resolved Wishlist 6 years ago
88222 EU::MM 6.74 fails on < 5.8.9 under certain conditions resolved Important 6 years ago 6.74
49043 pompt() on Windows doesn't remove the \r resolved Important 6 years ago 6.54
6.55_01
6.55_02
6.75_03
14505 MakeMaker bug parsing LDFLAGS resolved Unimportant 6 years ago 6.75_03
22767 Add RECURSIVE_TEST_FILES like Module::Build resolved Wishlist 6 years ago 6.75_03
32894 EU::Liblist::Kid chokes on -Wl,-framework flags resolved Normal 6 years ago 6.75_01
41941 Report type of Makefile the Makefile.PL is generating resolved Wishlist 6 years ago
21428 MakeMaker generated PPD files don't match the PPD spec. resolved Wishlist 6 years ago 6.30_03
84231 Make pure_install coerce failure resolved Important 6 years ago 6.65_01
71325 Adjust for broken WinZip interpretation of tarballs resolved Important 6 years ago 6.61_01
3003 DESTDIR shows up in .packlist. resolved Unimportant 6 years ago
444 win32 nmake: fatal error U1087: cannot have : and :: dependents for same target, when MAKEFILE=> is used resolved Unimportant 6 years ago 5.54_01
21129 NMAKE : fatal error U1073: don't know how to make ...\libConfig.pm' resolved Normal 6 years ago 6.30
6.30_01
16070 ExtUtils::Mksymlists Generates Bad Symbol resolved Normal 6 years ago
51508 t/basic.t does not run with the new EU::MM resolved Normal 6 years ago 6.54
22033 Test failure for rm_rf on a read-only directory resolved Unimportant 6 years ago 6.31
14721 Permssion problem on t/testdir resolved Unimportant 6 years ago 6.30
6131 LD_RUN_PATH/ -R animosity resolved Normal 6 years ago
12186 HTML Parser 3.45 fails to build on Solaris 10 resolved Normal 6 years ago
46658 Incompatible with older ExtUtils::Install resolved 6 years ago 6.74
51877 Needs support for new 'package NAME VERSION' syntax in blead resolved Normal 6 years ago
4545 MakeMaker in Win32 makes bad Makefile if PREFIX not set resolved Important 6 years ago 6.21
87839 Can't locate ExtUtils/Manifest.pm in @INC resolved Critical 6 years ago 6.70
6.72
6.73_10
87911 make dist output missing dot before gz suffix resolved Unimportant 6 years ago 6.72 6.73_11
88037 [PATCH] regen run of Makefile.PL will use same -MCross arg as initial .PL run resolved 6 years ago
83949 PERL_MM_OPT truncates multiple arguments to CCFLAGS at first whitespace resolved Normal 6 years ago 6.59
6.61_01
6.62
6.63_01
6.63_02
6.63_03
6.63_04
6.64
6.73_09
70201 [patch] replace -M with Time::HiRes::stat resolved Wishlist 6 years ago 6.59 6.73_09
58285 MakeMaker does not bootstrap without ExtUtils::Install resolved Unimportant 6 years ago 6.56 6.73_10
78943 EU::MM reports inaccurate $VERSION resolved Normal 6 years ago 6.63_02
86976 Version parsing bug introduced in 6.69_05 resolved 6 years ago 6.69_05
6.69_06
6.69_07
20662 Modules will not build without config.h resolved Normal 6 years ago
4550 'make dist' end with the file created resolved Wishlist 6 years ago
48721 Document versions for WriteMakeFile arguments resolved Wishlist 6 years ago 6.54
6.55_01
6.55_02
66113 WriteMakefile should fail if ^H or other special chars in arguments resolved Wishlist 6 years ago 6.57_06
21285 Document veryclean? resolved Wishlist 6 years ago
14680 suggestion for documentation change ExtUtils::MakeMaker 6.17 resolved Wishlist 6 years ago
31053 Mention configure_requires in PREREQ_FATAL documentation resolved Wishlist 6 years ago 6.36
64163 clean_subdirs infinite loop if subdir already gone resolved 6 years ago
79348 [RT #80040]: ExtUtils::MakeMaker doesn't support miniperl in installation paths resolved Normal 6 years ago
9452 Parsing of $VERSION fails for certain packages resolved Normal 6 years ago
28632 MakeMaker does not set Makefile variables recursively resolved Important 6 years ago 6.36
84356 `make dist` truncates version in META.yml resolved 6 years ago 6.64
69401 [perl #94532] [PATCH] 93862c2 Stabilize ExtUtils::MM_Cygwin::maybe_command resolved 6 years ago
61419 Avoid invisible interactive question when rebuilding Makefile resolved 6 years ago 6.44
6.57_05
86609 MakeMaker Fails to Recognize v-string Versions resolved 6 years ago
21532 Silence warnings on developer releases with $VERSION = eval $VERSION resolved Normal 6 years ago 6.30_04
6.55_02
6.57_07
47722 t/xs.t broken for MSVC compilation on Windows resolved Important 6 years ago 6.53_01
6.53_02
6.53_03
6.54
28484 IO doesn't use Win32::File to install IO.DLL under cygwin resolved Important 6 years ago
17672 $MM->pasthru() no longer detects '-nologo' on nmake -built perl resolved Normal 6 years ago 6.30_01 6.64
11616 processPL() uses "::" which breaks dmake resolved Normal 6 years ago 6.25_08
8518 find_perl should search directory-first resolved Normal 6 years ago
57008 Inconsistent use of print v. print STDOUT resolved Unimportant 6 years ago 6.56
73361 better description of 'NAME' resolved Normal 6 years ago 6.62
75882 embedding manifests resolved Normal 6 years ago 6.30 6.33
22768 Solve the MakeMaker upgrade issue. resolved Wishlist 6 years ago
60733 Test failures when perl has a relative path resolved Normal 6 years ago 6.56 6.69_05
32110 Possibly wrong META.yml output for empty PREREQ_PM resolved Unimportant 6 years ago 6.42
54703 [PATCH] Don't hardcode /cygdrive resolved Important 6 years ago 6.56
20717 Can't call method "VERSION" without a package or obj ref ... 5.8.8/ExtUtils/MakeMaker.pm line 394. resolved Unimportant 6 years ago
45432 EU::Liblist::Kid breaks ActivePerl + MinGW + PAR-Packer resolved Important 6 years ago 6.51_02 6.66
49026 Can't find libraries ending in .lib from Strawberry Perl resolved Important 6 years ago 6.54 6.66
86007 [PATCH] Move ‘Putting my or local on the preceding line’ resolved 6 years ago 6.67_05
85406 can't figure out how to get "repository":{"url":..., "web":..., "type": ...} into META.json resolved Normal 6 years ago 6.66 6.67_04
86118 test error installing ExtUtils-MakeMaker-6.66 using perl5.10 on MacOSX resolved 6 years ago 6.67_02
86076 Fails match on x_Repositoryclone resolved 6 years ago 6.66 6.67_02
85861 CentOS 6.4: test failures on 6.66 via cpanm resolved 6 years ago 6.66 6.67_02
74633 [perl #109618] [PATCH] 043be6e Allow linking of cygwin libraries resolved 6 years ago 6.67_01
77215 MM_Win32.pm & MAXLINELENGTH resolved 6 years ago 6.67_01
64490 keeping in sync with perl header files resolved 6 years ago
69528 6.58 in blead on MSWin32 fails tests resolved Normal 6 years ago 6.58
83441 Improper modification of hash during each() traversal in t/basic.t resolved Important 6 years ago 6.64
83448 Missing headers in ExtUtils-MakeMaker resolved Important 6 years ago
83246 www.makemaker.org is down resolved 6 years ago 6.64
84097 Teach MM_Any.pm to deal with VOS keep files (== core files) resolved Normal 6 years ago 6.64
78635 Halt when install t/INSTALL_BASE.t resolved Important 7 years ago 6.62
79359 MakeMaker dependency on Test::More resolved Normal 7 years ago 6.62
76720 No META.yml/.json generated resolved Critical 7 years ago 6.62
6.63_01
6.63_02
77468 Warnings about {} in regex in 5.17 and later resolved Normal 7 years ago
76758 MISMATCHED content between SIGNATURE and distribution files (v6.62) resolved 7 years ago
72096 commit f4904b4ce499b7f0c420efae69f44e19fe7dd12f breaks MM_Win32.t on windows resolved 8 years ago
72097 echo.t added with commit 69449ab8880bb8e00f9a890b95eec198d75b05ac is broken on windows resolved 8 years ago
71932 Do not use bundles when being packaged by FreeBSD resolved Wishlist 8 years ago 6.63_01
72098 commit ae3e30dee7a016cc90139c59f1257669d9e25081 breaks Makefile.PL, bundling related resolved 8 years ago
70232 Hang in t/INSTALL_BASE.t on FreeBSD resolved Normal 8 years ago 6.58
6.58_01
6.59
71847 Invalid nmake syntax in abstract resolved 8 years ago
69465 Bundle::CPAN resolved 8 years ago
69900 EUMM breaks the ability to build makefiles (perl Makefile.PL) resolved Critical 8 years ago 6.58
61779 "make AUTHOR also accept arrayref" broke MM->new({}) invocation resolved Wishlist 8 years ago 6.57_02
6.57_03
6.57_04
6.57_05
6.57_06
63848 EUMM 6.57_02 breaks Module::Install 1.00 resolved Important 8 years ago 6.57_02
6.57_03
6.57_04
6.57_05
6.57_06
64444 Two patches to backport from blead resolved 8 years ago
68743 Broken github link resolved Unimportant 8 years ago
61868 miniperl.t causes tests to fail under ActivePerl 1007 (with patch proposal) resolved Critical 9 years ago 6.57_05
61286 generated PM_TO_BLIB can be too long for ActivePerl resolved 9 years ago 6.56
55752 gcc check under Windows is broken resolved Critical 9 years ago 6.56
61399 Fix repository url resolved 9 years ago 6.57_05
61270 Version 6.57_02 breaks blead resolved 9 years ago
57124 foreach qw in MM_Any.pm resolved 9 years ago
55500 ExtUtils::MakeMaker fails "make test" with YAML::Tiny version 1.04 resolved Important 9 years ago 6.56
47138 ExtUtils::MakeMaker generate duplicate --image-base with gcc on windows. resolved Important 9 years ago
41360 ExtUtils::MakeMaker didn't recognize *.so under AIX (maybe other systems, too?) resolved Normal 9 years ago 6.48
53913 unpackaged blib directories resolved 9 years ago 6.51_01
49966 [PATCH] Fix Win32 Makefile generation resolved Important 10 years ago 6.55_02
48534 NO_XS on OS/2 resolved 10 years ago
24159 Please support build-time dependencies resolved Wishlist 10 years ago 6.30_01
47723 t/arch_check.t broken on Windows resolved Important 10 years ago 6.53_01
6.53_02
6.53_03
6.54
46585 [PATCH] Use Cygwin path built-in functions in tests resolved Important 10 years ago 6.52
47296 Test failures installing 1.52 on Mac OS X resolved 10 years ago
47448 Prereqs with no $VERSION resolved Unimportant 10 years ago 6.53_02
46744 [PATCH] Cygwin tests failing due to missing () resolved Important 10 years ago 6.53_01
6.53_02
46667 Win32, arch_check() and miniperl resolved 10 years ago
46633 6.52 causes link errors in Time::HiRes on VMS resolved Critical 10 years ago 6.52
46678 [PATCH] arch_check.t fails on VMS resolved Normal 10 years ago 6.52
46679 local $ENV{'bin'} = '[.bin]'; # is a noop on VMS. resolved 10 years ago 6.52
41060 Warning: Can't call method "isa" without a package or object reference resolved Normal 10 years ago 6.48
46416 arch_check() filepath separator mismatch on Win32 resolved 10 years ago
45454 make zipdist on Win32 resolved Normal 10 years ago
46100 'make ppd' specifies wrong ARCHITECTURE NAME in ppd file (5.10 only) resolved Normal 10 years ago 6.50
29955 make test (of ExtUtils::MakeMaker) fails on HP-UX resolved Normal 10 years ago
45557 Incorrect suffix rule to compile .C files resolved 10 years ago
44870 Web site (http://makemaker.org)) expired resolved Critical 10 years ago
3927 Respect umask during installation. resolved Wishlist 10 years ago
33532 [patch] don't complain about architecture mismatch on win32 resolved Normal 10 years ago
44932 Existance of BIN logical interferes with MakeMaker tests. resolved Important 10 years ago 6.50
35892 -Wdeclaration-after-statement warnings resolved Unimportant 10 years ago 6.44
44933 Re: Existance of BIN logical interferes with MakeMaker tests. resolved 10 years ago
3275 [perl5.8.0/win32] (ExtUtils::Install) NMAKE : fatal error U1095: expanded command line '< a lot of filenames>' too long resolved Normal 10 years ago 6.15
14656 Re: BUG: MAKEMAKER 6.30_01 and blead in MM_UNIX.pm for VMS resolved Normal 10 years ago
3730 Can't locate object method "post_initialize_target" when perl makefile.pl in PPI-0.7 resolved Normal 10 years ago 6.15
2470 [PATCH] ExtUtils::MM_Unix::parse_version resolved Wishlist 10 years ago
20144 Fwd: ExtUtils::MM_Win32::cd patch resolved Normal 10 years ago
20566 generated ppd files fail to install on ActiveState Perl 5.8 resolved Normal 10 years ago 6.30
6.30_01
16375 maybe_command() always fails on cygwin systems when examining paths in /cygdrive/* resolved Normal 10 years ago 6.30_01
43001 Don't check compiler version when embedding manifest file resolved 10 years ago
32758 [Fwd: MakeMaker: adjust install target dependencies to allow parallel makes] resolved 10 years ago
29442 Less restrictive #! check in fixin? resolved 10 years ago
34290 Better docs for MAN1PODS] resolved 10 years ago
33775 MakeMaker doesn't play nice on MacOSX - case sensitivity of "core" resolved 10 years ago
37639 MM_Win32 resolved Important 10 years ago
44504 EU:MM assumes the existance of the binary 'false' resolved Normal 10 years ago 6.48
25179 make ppd doesn't list prerequisites properly resolved Normal 10 years ago 6.05
32879 [PATCH] ppd target gets ARCHITECTURE NAME wrong in 5.10 resolved Normal 10 years ago 6.42
41574 [PATCH] PREREQ output may be garbled if modules defined $SIG{__WARN__} resolved Normal 10 years ago 6.48
43217 DISTVNAME parameter not recognized as valid resolved Normal 10 years ago 6.48
44646 Don't load the modules in PREREQ_PM resolved Important 10 years ago 6.50
43546 MakeMaker explodes and fails to install if Pod::Man is unavailable resolved 10 years ago
35190 Use of uninitialized value in length at /usr/lib/perl5/5.8.8/ExtUtils/Command/MM.pm line 134 resolved Unimportant 10 years ago 6.44
43511 basic.t has wrong skip count for VMS. resolved Normal 10 years ago 6.49_01
42927 EU::MM 6.48 test failures on Red Hat ES 5.2, perl 5.10.0 resolved 10 years ago
41572 [PATCH] Wrong usage of "or" (crept in with the "haiku" patch) resolved Normal 10 years ago
41571 [PATCH] svn repository has moved resolved Unimportant 10 years ago 6.48
14930 MM fails tests if PERL_MM_OPT is used resolved Unimportant 11 years ago 6.30
33813 [PATCH] cd.t expects unix syntax resolved Important 11 years ago
28374 [PATCH] add support for 'perl' in PREREQ_PM resolved Normal 11 years ago
39348 META_MERGE overwrites no_index defaults resolved 11 years ago 6.45_02
21282 Split metafile generation into user overridable methods. resolved Wishlist 11 years ago
32337 Add configure_requires: MakeMaker to generated META.yml resolved Wishlist 11 years ago
30098 Documentation for EXTRA_META is missing resolved Normal 11 years ago 6.36
36047 @MM_Sections and @Overridable now private? resolved Normal 11 years ago 6.44
37546 Liblist/Kid.pm ! versus =~ resolved 11 years ago
34971 ExtUtils::MakeMaker Requires All Parent Directories to be Readable? resolved 11 years ago
34045 MakeMaker - timestamp of manyfi resolved 11 years ago
33291 cygwin: Problem in ExtUtils::Install causes MakeMaker to be unusable resolved Critical 11 years ago 6.42
33161 Generated Makefile contains syntax error with missing } resolved Normal 11 years ago 6.42
20145 Fwd: MM_Any::split_command - 20% for macro expansion resolved Important 12 years ago
24746 E::MM 6.31 fails to install ontop of 5.45because ExtUtils::Command::MM isn't available resolved Important 12 years ago 6.31
23545 DISTVNAME not working? resolved Unimportant 12 years ago 6.31
11374 ExtUtils::MakeMaker doesn't handle VERSION defined with version.pm resolved Unimportant 12 years ago 6.25
29525 Keeping ',_' files out of distribution tarballs on OS X resolved Important 12 years ago
22674 Modules inc/ are not used while testing. resolved Important 12 years ago
32020 Doc: valid values for "LICENSE" resolved Unimportant 12 years ago 6.42
21423 Change PREREQ_FATAL so it displays all the missing prereqs resolved Wishlist 12 years ago 6.30_03
31205 (No subject) resolved Critical 12 years ago 6.36
30747 parse_version() confused by sub version() in $VERSION line. resolved Important 12 years ago
30971 6.37_01 broken for XS resolved Critical 12 years ago 6.36
29060 MakeMaker + static misbehaviour resolved 12 years ago
30129 tests fail on ActiveState 5.8.8 (822) -- upgrading EU::Install fixes it resolved Normal 12 years ago 6.36
27838 Hard-coded strict version in test resolved Normal 12 years ago 6.33
23931 Generated META.yml lacks trailing newline resolved Normal 12 years ago 6.31
24774 PREREQ_FATAL not overridable on the commandline resolved 12 years ago
26075 [PATCH] Re: Version object support resolved 12 years ago
26161 [PATCH] Assorted changes from bleadperl resolved 12 years ago
27283 Please create a new EU-MM release containing core changes suitable for perl-5.8.9 resolved Important 12 years ago 6.32
27804 Test failure in subprojects does not cause "make test" to exit with non-zero resolved Critical 12 years ago
19107 Make MM_Win32 cd back from subdirectories resolved Normal 12 years ago 6.30
2770 ../lib causing smoking problems resolved Unimportant 12 years ago
21284 Add .bak and .old to veryclean? resolved Wishlist 12 years ago
12919 Add FAQ about what's wrong with PREFIX. resolved Wishlist 12 years ago
23178 find_perl does not find perl in some circumstances resolved Unimportant 12 years ago 6.31
25180 subdirs Makefile section not generated properly resolved Important 12 years ago 6.30
25268 [PATCH] ExtUtils::Liblist::Kid::_vms_ext, better debug check resolved Important 12 years ago 6.32
25913 tar options on NTFS for CPAN submissions resolved 12 years ago
26234 From P5P - [PATCH] ExtUtils/MM_Unix.pm (fixin): do not clobber $/ resolved 12 years ago
26208 From P5P - [PATCH] Restore Win64 compilation with the Windows Platform SDK resolved 12 years ago
26543 6.32 still includes t/Install.t and t/Installed.t resolved Critical 12 years ago 6.32
24098 ExtUtils::MM_Win32 produces incomplete makefiles for VS2005 resolved Critical 12 years ago 6.31
26995 FAQ: How do I keep my $VERSION up to date without resetting it manually? resolved Important 12 years ago 6.32
21318 EU::MM provides the same files as EU::I -- package managers conflicts arise resolved Important 12 years ago 6.30
26160 [PATCH] Changes needed to embed manifest files when building with VC++ 8.x resolved 12 years ago 6.32
23420 Fails one test on Win32 resolved Critical 12 years ago 6.31
23526 FW: [PATCH lib/ExtUtils/t/build_man.t] installman3dir is null resolved Normal 12 years ago 6.31
23495 Documentation bug: $(TOUNIX) instead of $(TO_UNIX) resolved Unimportant 12 years ago 6.25
6.25_01
6.25_02
6.25_03
6.25_04
6.25_05
6.25_06
6.25_07
6.25_08
6.25_09
6.25_10
6.25_11
6.25_12
6.26
6.26_01
6.27
6.28
6.29
6.30
6.30_01
6.30_02
6.30_03
6.30_04
6.31
25056 Failing test build_man#4 on linux resolved Critical 12 years ago 6.31
24271 INSTALLBIN and INSTALLSCRIPT not used correctly resolved Critical 13 years ago 6.31
22622 BUG maybe resolved 13 years ago
17332 META.yml no longer created resolved Important 13 years ago 6.30
22149 Bug in ExtUtils::MM_Any::manifypod_target() resolved 13 years ago
17224 Generated Makefiles reference PERLRUN instead of PERLRUNINST resolved Important 13 years ago 6.30
6.30_01
6.17
15541 SEE ALSO: Module::Build resolved Important 13 years ago
8528 Implement INSTALL_BASE like Module::Build has resolved Important 13 years ago
14657 [patch@makemaker_6.30_01] VMS fixes FIRST_MAKEFILE, PL_FILES resolved Important 13 years ago
15054 I detected a problem in ExtUtils::MakeMaker’s created MAKEFILE. resolved Important 13 years ago 6.17
15439 Perl.exe/WinXP/Visual Studio 6 resolved Important 13 years ago 6.30
6.30_01
16512 MakeMaker prereq check failed for Time::Format_XS v1.02 resolved Important 13 years ago
17038 [PATCH] assorted small VMS fixes resolved Important 13 years ago
17671 t/MM_Win32.t failures on Win32 resolved Normal 13 years ago 6.30_01
667 Make Maker with LARGE module list resolved Normal 13 years ago 6.00
5664 Makefile:346: *** multiple target patterns. Stop. resolved Normal 13 years ago
20462 Overriding MAN3PODS doesn't stop them from getting built resolved 13 years ago
20565 fix for MM_Win32.t test "31 - path() [preset]" resolved Important 13 years ago 6.30
6.30_01
14678 Delete perldepend() if unused. resolved Wishlist 14 years ago
14362 (No subject) resolved Critical 14 years ago
8561 EU::MM doesn't support the META.yml licence tag resolved Wishlist 14 years ago
12254 Error in &ExtUtils::MM_AIX resolved Important 14 years ago 6.27
12495 FIRST_MAKEFILE doesn't work, always creates Makefile resolved Normal 14 years ago
2466 error in ExtUtils/Liblist/Kid.pm resolved Important 14 years ago 6.10_03
11612 ExtUtils::MakeMaker fails 'make test' resolved Important 14 years ago 6.25
11497 Error with pm_to_blib.ts target building libwin32 resolved Important 14 years ago 6.25_08
11314 generated Makefile is broken for SVK resolved Important 14 years ago 6.25_07
5365 hints test fail on make resolved Normal 15 years ago 6.21
8923 Make test_harness() expand globs on Win32 resolved 15 years ago
3096 cleanup *clean targets resolved Wishlist 15 years ago
8532 Real SIGNATURE should be created in distdir. resolved Wishlist 15 years ago
4688 Remove extra mmk all target. resolved Unimportant 15 years ago
8238 dir_target resolved Normal 15 years ago
6460 [Parallel bulid] rules using $(PERLRUNINST) should depend on pm_to_blib resolved Normal 15 years ago 6.17
6.18
6.19
6.20
6.21
6851 make clean deletes "perl" subdirectory resolved Important 15 years ago 6.21
6137 "make distcheck" borken on 6.21_03 resolved Important 15 years ago
7417 SKIP doesn't work on NetBSD make resolved Normal 15 years ago 6.21
8809 ExtUtils::MM_Unix::init_dirscan should ignore Build.PL resolved Normal 15 years ago 6.24
8597 ExtUtils::MM_MacOS out of date in CPAN resolved 15 years ago 6.22
4430 Win32 and XS extensions resolved Normal 15 years ago 6.21
8486 EU:MM handling of ABSTRACT_FROM doesn't handle pod formatting codes resolved Normal 15 years ago 6.21
5633 parse_version.t fails 10/10 resolved Important 15 years ago 6.21
4676 chmod on a VMS directory needs help resolved Unimportant 15 years ago
4675 pm_to_blib and blibdirs need .ts files on VMS resolved Important 15 years ago 6.18
4687 Fix ExtUtils::Command so it fully deletes files on VMS resolved Unimportant 15 years ago
4955 fixpath sometimes undoes wraplist on VMS resolved Normal 15 years ago 6.17
5208 problem with the realclean target resolved 15 years ago
5312 Can't create Makefile for DCE-Perl resolved Unimportant 15 years ago 6.17
5616 Make oneliners and other tools use ABSPERLRUN resolved Normal 15 years ago
4586 blibdirs should not be a :: target resolved Important 15 years ago 6.21
4341 Emulate dir_target() with blibdirs resolved Unimportant 16 years ago 6.20
4301 makefile(652) : fatal error U1001: syntax error resolved Critical 16 years ago 6.19
3327 "cannot create META.yml: permission denied" resolved Normal 16 years ago
4290 make test failure on 5.00503 resolved 16 years ago 6.19
4285 in v6.19 MM_Any.pm has $! but needs $$! on line 637 resolved Normal 16 years ago
4193 Remove perl.h dependency for non-XS modules. resolved Wishlist 16 years ago
4230 install(site|vendor)man*dir should fallback to installman*dir resolved Important 16 years ago
3180 maniadd fails unnessarily resolved Normal 16 years ago 6.15
3136 Put POD2MAN back resolved Important 16 years ago
433 tests in subdirs do not find modules in blib resolved Normal 16 years ago 5.54_01
2954 DESTDIR duplicated when PREFIX set. Also DESTDIR in perllocal.pod and .packlist. resolved 16 years ago
2951 NORECURS => 1 still producing recursive Makefiles resolved Important 16 years ago
2949 $Config{installvendorman*dir} not honored resolved Important 16 years ago
2837 Subversion patch resolved Wishlist 16 years ago
2747 Move BFD_TEST_ROOT one level down resolved 16 years ago
2723 Automatic writing of META.yml resolved Normal 16 years ago 6.10_04
693 Big list of perl header files needs to be version flexible. resolved 16 years ago
2444 problem with manifests with no newline at the end and META.yml resolved 16 years ago
2591 enhancement for ExtUtils::Liblist - LD_RUN_PATH resolved Wishlist 16 years ago 6.05
2543 [PATCH} extended make clean resolved Normal 16 years ago 6.10_03
2588 Redhat 9.0 Config.pm broken, effects MakeMaker resolved Important 16 years ago 6.05
2359 NO_META support resolved 16 years ago
1686 Variables expanded too far in Makefile resolved Normal 16 years ago 6.03
6.04
6.05
1550 ppd and hints problems on VMS resolved Normal 16 years ago 6.05
385 win32 -- Perl Makefile.PL stage fails resolved Critical 16 years ago 5.50_01
2022 warning creating Makefile resolved Normal 16 years ago 6.06_02
1884 Prerequisite modules which exist are reported as not found resolved Normal 16 years ago 6.06_01
1771 default lib dir should examine $Config{installstyle} resolved Normal 17 years ago 6.05
327 Special dmake/Win95 logic in subdirs() causing problems resolved Normal 17 years ago
1473 IF ABSTRACT has " in it, nmake ppd fails on win32 resolved Critical 17 years ago 6.00
6.01
6.02
6.03
707 WriteMakefile verification a little off. resolved Important 17 years ago 6.01
697 MM_NW5 bits of bleadperl #16922 resolved 17 years ago
561 blead #16371 resolved Important 17 years ago 5.92_01
681 bleadperl #16851 (part of) resolved Normal 17 years ago 6.00
679 bleadperl #16839 resolved Normal 17 years ago 6.00
668 pickup MM_NW5.pm hunk of bleadperl #16811 resolved Normal 17 years ago 6.00
625 Perl 5.6.1 vs VMS vs MM 5.95_02 (fwd from p5p) resolved Normal 17 years ago 5.95_01
447 Tests too deep for 8 level VMS limit. resolved Unimportant 17 years ago 5.55_01
599 pickup bleadperl #16582 resolved Important 17 years ago
590 pickup blead #16548 resolved Normal 17 years ago 5.93_01
603 bleadperl #16603 resolved Normal 17 years ago
533 pickup bleadperl #16190 resolved Important 17 years ago 5.91_01
539 MM_Win95 devoid of any docs resolved Normal 17 years ago 5.91_01
534 pickup bleadperl #15233 resolved 17 years ago
502 INSTALLMAN?DIR and INST_MAN?DIR not recognized resolved Normal 17 years ago 5.90_01
480 MakeMaker installdirectories NOT OK for Win32 resolved Important 17 years ago 5.90_01
422 Falsely reporting missing files in PDL's MANIFEST resolved Important 17 years ago 5.52_01
413 [PATCH] Re: Underspecified MANIFEST.SKIP behavior resolved Important 17 years ago 5.52_01
423 TEST_VERBOSE not working in 5.52_01? resolved Important 17 years ago 5.52_01

This service is sponsored and maintained by Best Practical Solutions and runs on Perl.org infrastructure.

Please report any issues with rt.cpan.org to rt-cpan-admin@bestpractical.com.