Skip Menu |
 

This queue is for tickets about the Iterator-Paged CPAN distribution.

Report information
The Basics
Id: 77712
Status: open
Priority: 0/
Queue: Iterator-Paged

People
Owner: Nobody in particular
Requestors: perl [...] evancarroll.com
Cc:
AdminCc:

Bug Information
Severity: (no value)
Broken in: (no value)
Fixed in: (no value)



Subject: Test failure on Perl v5.14.2
Download (untitled) / with headers
text/plain 3.4k
Test Summary Report ------------------- t/020-subclass/010-cpan-authors.t (Wstat: 7168 Tests: 31 Failed: 28) Failed tests: 4-31 Non-zero exit status: 28 Files=2, Tests=32, 2 wallclock secs ( 0.04 usr 0.00 sys + 0.22 cusr 0.01 csys = 0.27 CPU) Result: FAIL Failed 1/2 test programs. 28/32 subtests failed. make: *** [test_dynamic] Error 28 [ERROR] MAKE TEST failed: PERL_DL_NONLAZY=1 /usr/bin/perl "- MExtUtils::Command::MM" "-e" "test_harness(0, 'inc', 'blib/lib', 'blib/arch')" t/010-basic/*.t t/020-subclass/*.t t/010-basic/010-compile.t .......... ok # Failed test 'Saw page 'A'' # at t/020-subclass/010-cpan-authors.t line 29. # Failed test 'Saw page 'B'' # at t/020-subclass/010-cpan-authors.t line 29. # Failed test 'Saw page 'C'' # at t/020-subclass/010-cpan-authors.t line 29. # Failed test 'Saw page 'D'' # at t/020-subclass/010-cpan-authors.t line 29. # Failed test 'Saw page 'E'' # at t/020-subclass/010-cpan-authors.t line 29. # Failed test 'Saw page 'F'' # at t/020-subclass/010-cpan-authors.t line 29. # Failed test 'Saw page 'G'' # at t/020-subclass/010-cpan-authors.t line 29. # Failed test 'Saw page 'H'' # at t/020-subclass/010-cpan-authors.t line 29. # Failed test 'Saw page 'I'' # at t/020-subclass/010-cpan-authors.t line 29. # Failed test 'Saw page 'J'' # at t/020-subclass/010-cpan-authors.t line 29. # Failed test 'Saw page 'K'' # at t/020-subclass/010-cpan-authors.t line 29. # Failed test 'Saw page 'L'' # at t/020-subclass/010-cpan-authors.t line 29. # Failed test 'Saw page 'M'' # at t/020-subclass/010-cpan-authors.t line 29. # Failed test 'Saw page 'N'' # at t/020-subclass/010-cpan-authors.t line 29. # Failed test 'Saw page 'O'' # at t/020-subclass/010-cpan-authors.t line 29. # Failed test 'Saw page 'P'' # at t/020-subclass/010-cpan-authors.t line 29. # Failed test 'Saw page 'Q'' # at t/020-subclass/010-cpan-authors.t line 29. # Failed test 'Saw page 'R'' # at t/020-subclass/010-cpan-authors.t line 29. # Failed test 'Saw page 'S'' # at t/020-subclass/010-cpan-authors.t line 29. # Failed test 'Saw page 'T'' # at t/020-subclass/010-cpan-authors.t line 29. # Failed test 'Saw page 'U'' # at t/020-subclass/010-cpan-authors.t line 29. # Failed test 'Saw page 'V'' # at t/020-subclass/010-cpan-authors.t line 29. # Failed test 'Saw page 'W'' # at t/020-subclass/010-cpan-authors.t line 29. # Failed test 'Saw page 'X'' # at t/020-subclass/010-cpan-authors.t line 29. # Failed test 'Saw page 'Y'' # at t/020-subclass/010-cpan-authors.t line 29. # Failed test 'Saw page 'Z'' # at t/020-subclass/010-cpan-authors.t line 29. # Failed test 'Saw aadler' # at t/020-subclass/010-cpan-authors.t line 31. # Failed test 'Saw zzcgumk' # at t/020-subclass/010-cpan-authors.t line 32. # Looks like you failed 28 tests of 31. t/020-subclass/010-cpan-authors.t .. Dubious, test returned 28 (wstat 7168, 0x1c00) Failed 28/31 subtests Test Summary Report ------------------- t/020-subclass/010-cpan-authors.t (Wstat: 7168 Tests: 31 Failed: 28) Failed tests: 4-31 Non-zero exit status: 28 Files=2, Tests=32, 2 wallclock secs ( 0.04 usr 0.00 sys + 0.22 cusr 0.01 csys = 0.27 CPU) Result: FAIL Failed 1/2 test programs. 28/32 subtests failed. make: *** [test_dynamic] Error 28 The tests for 'Iterator::Paged' failed. Would you like me to proceed anyway or should we abort? Proceed anyway? [y/N]: -- Evan Carroll System Lord of the Internets http://www.evancarroll.com
Download (untitled) / with headers
text/plain 3.8k
On 2012-06-08 14:39:27, ECARROLL wrote: Show quoted text
> Test Summary Report > ------------------- > t/020-subclass/010-cpan-authors.t (Wstat: 7168 Tests: 31 Failed: 28) > Failed tests: 4-31 > Non-zero exit status: 28 > Files=2, Tests=32, 2 wallclock secs ( 0.04 usr 0.00 sys + 0.22 cusr > 0.01 csys = 0.27 CPU) > Result: FAIL > Failed 1/2 test programs. 28/32 subtests failed. > make: *** [test_dynamic] Error 28 > [ERROR] MAKE TEST failed: PERL_DL_NONLAZY=1 /usr/bin/perl "- > MExtUtils::Command::MM" "-e" "test_harness(0, 'inc', 'blib/lib', > 'blib/arch')" t/010-basic/*.t t/020-subclass/*.t > t/010-basic/010-compile.t .......... ok > > # Failed test 'Saw page 'A'' > # at t/020-subclass/010-cpan-authors.t line 29. > > # Failed test 'Saw page 'B'' > # at t/020-subclass/010-cpan-authors.t line 29. > > # Failed test 'Saw page 'C'' > # at t/020-subclass/010-cpan-authors.t line 29. > > # Failed test 'Saw page 'D'' > # at t/020-subclass/010-cpan-authors.t line 29. > > # Failed test 'Saw page 'E'' > # at t/020-subclass/010-cpan-authors.t line 29. > > # Failed test 'Saw page 'F'' > # at t/020-subclass/010-cpan-authors.t line 29. > > # Failed test 'Saw page 'G'' > # at t/020-subclass/010-cpan-authors.t line 29. > > # Failed test 'Saw page 'H'' > # at t/020-subclass/010-cpan-authors.t line 29. > > # Failed test 'Saw page 'I'' > # at t/020-subclass/010-cpan-authors.t line 29. > > # Failed test 'Saw page 'J'' > # at t/020-subclass/010-cpan-authors.t line 29. > > # Failed test 'Saw page 'K'' > # at t/020-subclass/010-cpan-authors.t line 29. > > # Failed test 'Saw page 'L'' > # at t/020-subclass/010-cpan-authors.t line 29. > > # Failed test 'Saw page 'M'' > # at t/020-subclass/010-cpan-authors.t line 29. > > # Failed test 'Saw page 'N'' > # at t/020-subclass/010-cpan-authors.t line 29. > > # Failed test 'Saw page 'O'' > # at t/020-subclass/010-cpan-authors.t line 29. > > # Failed test 'Saw page 'P'' > # at t/020-subclass/010-cpan-authors.t line 29. > > # Failed test 'Saw page 'Q'' > # at t/020-subclass/010-cpan-authors.t line 29. > > # Failed test 'Saw page 'R'' > # at t/020-subclass/010-cpan-authors.t line 29. > > # Failed test 'Saw page 'S'' > # at t/020-subclass/010-cpan-authors.t line 29. > > # Failed test 'Saw page 'T'' > # at t/020-subclass/010-cpan-authors.t line 29. > > # Failed test 'Saw page 'U'' > # at t/020-subclass/010-cpan-authors.t line 29. > > # Failed test 'Saw page 'V'' > # at t/020-subclass/010-cpan-authors.t line 29. > > # Failed test 'Saw page 'W'' > # at t/020-subclass/010-cpan-authors.t line 29. > > # Failed test 'Saw page 'X'' > # at t/020-subclass/010-cpan-authors.t line 29. > > # Failed test 'Saw page 'Y'' > # at t/020-subclass/010-cpan-authors.t line 29. > > # Failed test 'Saw page 'Z'' > # at t/020-subclass/010-cpan-authors.t line 29. > > # Failed test 'Saw aadler' > # at t/020-subclass/010-cpan-authors.t line 31. > > # Failed test 'Saw zzcgumk' > # at t/020-subclass/010-cpan-authors.t line 32. > # Looks like you failed 28 tests of 31. > t/020-subclass/010-cpan-authors.t .. > Dubious, test returned 28 (wstat 7168, 0x1c00) > Failed 28/31 subtests > > Test Summary Report > ------------------- > t/020-subclass/010-cpan-authors.t (Wstat: 7168 Tests: 31 Failed: 28) > Failed tests: 4-31 > Non-zero exit status: 28 > Files=2, Tests=32, 2 wallclock secs ( 0.04 usr 0.00 sys + 0.22 cusr > 0.01 csys = 0.27 CPU) > Result: FAIL > Failed 1/2 test programs. 28/32 subtests failed. > make: *** [test_dynamic] Error 28 > > > > The tests for 'Iterator::Paged' failed. Would you like me to proceed > anyway or should we abort? > > Proceed anyway? [y/N]: >
It's not 5.14.2 only, it fails also with other perls, randomly. See http://matrix.cpantesters.org/?dist=Iterator-Paged%201.001


This service is sponsored and maintained by Best Practical Solutions and runs on Perl.org infrastructure.

Please report any issues with rt.cpan.org to rt-cpan-admin@bestpractical.com.