Skip Menu |
 

This queue is for tickets about the MailFolder CPAN distribution.

Report information
The Basics
Id: 767
Status: new
Priority: 0/
Queue: MailFolder

People
Owner: Nobody in particular
Requestors: pollock [...] theorem.ca
Cc:
AdminCc:

Bug Information
Severity: Normal
Broken in: (no value)
Fixed in: (no value)



Subject: build errors -- "sort" and "get" tests fail
Download (untitled) / with headers
text/plain 8.4k
I'm running RedHat with kernel 2.4.13 and perl v5.6.0 built for i386-linux. I can't really say terribly more than, it fails various tests when I install it with CPAN. As far as I know, I have no strange configurations that should cause problems. ---------------------------------------------------------- Show quoted text
cpan> install Mail::Folder
Running install for module Mail::Folder Running make for K/KJ/KJOHNSON/MailFolder-0.07.tar.gz Is already unwrapped into directory /etc/.cpan/build/MailFolder-0.07 Has already been processed within this session Running make test /usr/bin/perl t/TEST 0 emaul/01_emaul........ok emaul/02_empty........ok emaul/03_sync.........ok emaul/04_curr.........ok emaul/05_get..........MIME::Parser=HASH(0x84e4510) isn't a subclass of MIME::ParserBase at emaul/05_get.t line 25 emaul/05_get..........dubious Test returned status 255 (wstat 65280, 0xff00) DIED. FAILED tests 15-24 Failed 10/24 tests, 58.33% okay emaul/06_label........ok emaul/07_del..........ok emaul/08_sort.........make: *** [test] Interrupt /usr/bin/make test -- NOT OK Running make install make test had returned bad status, won't install without force Show quoted text
cpan>
Caught SIGINT Show quoted text
cpan> quit
quit Lockfile removed. [root@cauchy root]# cpan cpan shell -- CPAN exploration and modules installation (v1.61) ReadLine support enabled Show quoted text
cpan> install Mail::Folder
Going to read /etc/.cpan/sources/authors/01mailrc.txt.gz Going to read /etc/.cpan/sources/modules/02packages.details.txt.gz Database was generated on Wed, 19 Jun 2002 23:40:13 GMT CPAN: HTTP::Date loaded ok Going to read /etc/.cpan/sources/modules/03modlist.data.gz Running install for module Mail::Folder Running make for K/KJ/KJOHNSON/MailFolder-0.07.tar.gz CPAN: Digest::MD5 loaded ok Checksum for /etc/.cpan/sources/authors/id/K/KJ/KJOHNSON/MailFolder-0.07.tar.gz ok Scanning cache /etc/.cpan/build for sizes MailFolder-0.07/ MailFolder-0.07/t/ MailFolder-0.07/t/emaul.pl MailFolder-0.07/t/mbox/ MailFolder-0.07/t/mbox/12_refile.t MailFolder-0.07/t/mbox/03_sync.t MailFolder-0.07/t/mbox/01_mbox.t MailFolder-0.07/t/mbox/04_curr.t MailFolder-0.07/t/mbox/11_pack.t MailFolder-0.07/t/mbox/06_label.t MailFolder-0.07/t/mbox/09_select.t MailFolder-0.07/t/mbox/08_sort.t MailFolder-0.07/t/mbox/07_del.t MailFolder-0.07/t/mbox/05_get.t MailFolder-0.07/t/mbox/13_update.t MailFolder-0.07/t/mbox/10_append.t MailFolder-0.07/t/mbox/02_empty.t MailFolder-0.07/t/mbox.pl MailFolder-0.07/t/TEST MailFolder-0.07/t/maildir/ MailFolder-0.07/t/maildir/02_empty.t MailFolder-0.07/t/maildir/12_refile.t MailFolder-0.07/t/maildir/03_sync.t MailFolder-0.07/t/maildir/01_maildir.t MailFolder-0.07/t/maildir/04_curr.t MailFolder-0.07/t/maildir/11_pack.t MailFolder-0.07/t/maildir/06_label.t MailFolder-0.07/t/maildir/09_select.t MailFolder-0.07/t/maildir/08_sort.t MailFolder-0.07/t/maildir/07_del.t MailFolder-0.07/t/maildir/05_get.t MailFolder-0.07/t/maildir/13_update.t MailFolder-0.07/t/maildir/10_append.t MailFolder-0.07/t/emaul/ MailFolder-0.07/t/emaul/13_update.t MailFolder-0.07/t/emaul/10_append.t MailFolder-0.07/t/emaul/06_label.t MailFolder-0.07/t/emaul/12_refile.t MailFolder-0.07/t/emaul/07_del.t MailFolder-0.07/t/emaul/03_sync.t MailFolder-0.07/t/emaul/05_get.t MailFolder-0.07/t/emaul/04_curr.t MailFolder-0.07/t/emaul/11_pack.t MailFolder-0.07/t/emaul/09_select.t MailFolder-0.07/t/emaul/08_sort.t MailFolder-0.07/t/emaul/02_empty.t MailFolder-0.07/t/emaul/01_emaul.t MailFolder-0.07/t/maildir.pl MailFolder-0.07/t/all.pl MailFolder-0.07/BUGS MailFolder-0.07/MANIFEST MailFolder-0.07/NEWS MailFolder-0.07/testfolders/ MailFolder-0.07/testfolders/maildir_seed/ MailFolder-0.07/testfolders/maildir_seed/cur/ MailFolder-0.07/testfolders/maildir_seed/cur/839215913.3007.fargle.fz MailFolder-0.07/testfolders/maildir_seed/cur/839214040.1024.fargle.fz:2,FR MailFolder-0.07/testfolders/emaul_seed/ MailFolder-0.07/testfolders/emaul_seed/.msg_labels MailFolder-0.07/testfolders/emaul_seed/1 MailFolder-0.07/testfolders/emaul_seed/3 MailFolder-0.07/testfolders/mbox_seed MailFolder-0.07/Makefile.PL MailFolder-0.07/examples/ MailFolder-0.07/examples/from.pl MailFolder-0.07/examples/xmailfolder.pl MailFolder-0.07/examples/getpop.pl MailFolder-0.07/examples/README MailFolder-0.07/ANNOUNCE MailFolder-0.07/Mail/ MailFolder-0.07/Mail/Folder/ MailFolder-0.07/Mail/Folder/Emaul.pm MailFolder-0.07/Mail/Folder/Maildir.pm MailFolder-0.07/Mail/Folder/NNTP.pm MailFolder-0.07/Mail/Folder/Mbox.pm MailFolder-0.07/Mail/Folder.pm MailFolder-0.07/CREDITS MailFolder-0.07/README MailFolder-0.07/TODO Removing previously used /etc/.cpan/build/MailFolder-0.07 CPAN.pm: Going to build K/KJ/KJOHNSON/MailFolder-0.07.tar.gz Checking if your kit is complete... Looks good Writing Makefile for Mail mkdir blib mkdir blib/lib mkdir blib/lib/auto mkdir blib/lib/auto/Mail mkdir blib/arch mkdir blib/arch/auto mkdir blib/arch/auto/Mail mkdir blib/man3 cp Mail/Folder/Emaul.pm blib/lib/Mail/Folder/Emaul.pm cp Mail/Folder/Mbox.pm blib/lib/Mail/Folder/Mbox.pm cp Mail/Folder.pm blib/lib/Mail/Folder.pm cp Mail/Folder/Maildir.pm blib/lib/Mail/Folder/Maildir.pm cp Mail/Folder/NNTP.pm blib/lib/Mail/Folder/NNTP.pm Manifying blib/man3/Mail::Folder::Emaul.3pm Manifying blib/man3/Mail::Folder::Mbox.3pm Manifying blib/man3/Mail::Folder.3pm Manifying blib/man3/Mail::Folder::Maildir.3pm Manifying blib/man3/Mail::Folder::NNTP.3pm /usr/bin/make -j3 -- OK Running make test /usr/bin/perl t/TEST 0 emaul/01_emaul........ok emaul/02_empty........ok emaul/03_sync.........ok emaul/04_curr.........ok emaul/05_get..........MIME::Parser=HASH(0x84e4510) isn't a subclass of MIME::ParserBase at emaul/05_get.t line 25 emaul/05_get..........dubious Test returned status 255 (wstat 65280, 0xff00) DIED. FAILED tests 15-24 Failed 10/24 tests, 58.33% okay emaul/06_label........ok emaul/07_del..........ok emaul/08_sort.........Sort subroutine didn't return single value at ../blib/lib/Mail/Folder.pm line 982. emaul/08_sort.........dubious Test returned status 9 (wstat 2304, 0x900) DIED. FAILED tests 2-4 Failed 3/4 tests, 25.00% okay emaul/09_select.......ok emaul/10_append.......ok emaul/11_pack.........ok emaul/12_refile.......ok emaul/13_update.......ok mbox/01_mbox..........ok mbox/02_empty.........ok mbox/03_sync..........ok mbox/04_curr..........ok mbox/05_get...........MIME::Parser=HASH(0x84f10d4) isn't a subclass of MIME::ParserBase at mbox/05_get.t line 26 mbox/05_get...........dubious Test returned status 255 (wstat 65280, 0xff00) DIED. FAILED tests 15-29 Failed 15/29 tests, 48.28% okay mbox/06_label.........ok mbox/07_del...........ok mbox/08_sort..........Sort subroutine didn't return single value at ../blib/lib/Mail/Folder.pm line 982. mbox/08_sort..........dubious Test returned status 2 (wstat 512, 0x200) DIED. FAILED tests 2-4 Failed 3/4 tests, 25.00% okay mbox/09_select........ok mbox/10_append........ok mbox/11_pack..........ok mbox/12_refile........ok mbox/13_update........ok maildir/01_maildir....ok maildir/02_empty......ok maildir/03_sync.......ok maildir/04_curr.......ok maildir/05_get........MIME::Parser=HASH(0x8529370) isn't a subclass of MIME::ParserBase at maildir/05_get.t line 26 maildir/05_get........dubious Test returned status 255 (wstat 65280, 0xff00) DIED. FAILED tests 15-24 Failed 10/24 tests, 58.33% okay maildir/06_label......ok maildir/07_del........ok maildir/08_sort.......Sort subroutine didn't return single value at ../blib/lib/Mail/Folder.pm line 982. maildir/08_sort.......dubious Test returned status 9 (wstat 2304, 0x900) DIED. FAILED tests 2-4 Failed 3/4 tests, 25.00% okay maildir/09_select.....ok maildir/10_append.....ok maildir/11_pack.......ok maildir/12_refile.....FAILED tests 13-14 Failed 2/16 tests, 87.50% okay maildir/13_update.....ok Failed Test Stat Wstat Total Fail Failed List of Failed ------------------------------------------------------------------------------- emaul/05_get.t 255 65280 24 10 41.67% 15-24 emaul/08_sort.t 9 2304 4 3 75.00% 2-4 maildir/05_get.t 255 65280 24 10 41.67% 15-24 maildir/08_sort.t 9 2304 4 3 75.00% 2-4 maildir/12_refile.t 16 2 12.50% 13-14 mbox/05_get.t 255 65280 29 15 51.72% 15-29 mbox/08_sort.t 2 512 4 3 75.00% 2-4 Failed 7/39 test scripts, 82.05% okay. 46/570 subtests failed, 91.93% okay. make: *** [test] Error 29 /usr/bin/make test -- NOT OK Running make install make test had returned bad status, won't install without force


This service is sponsored and maintained by Best Practical Solutions and runs on Perl.org infrastructure.

Please report any issues with rt.cpan.org to rt-cpan-admin@bestpractical.com.