Skip Menu |
 

This queue is for tickets about the Data-Dump-Streamer CPAN distribution.

Report information
The Basics
Id: 51265
Status: resolved
Priority: 0/
Queue: Data-Dump-Streamer

People
Owner: Nobody in particular
Requestors: TSS [...] cpan.org
Cc:
AdminCc:

Bug Information
Severity: Normal
Broken in: 2.09
Fixed in: (no value)



Subject: Most Recent Version Fails Tests
********************************************** Summary And Notes ********************************************** The most recent version of Data::Dump::Streamer fails a few tests. I was trying to install Devel::REPL and Data::Dump::Streamer is a prerequisite. I have attached a full build log for Devel::REPL, but the relevant part is provided below. ********************************************** Perl Version ********************************************** tss@paren:~$ perl -v This is perl, v5.10.0 built for x86_64-linux-gnu-thread-multi ********************************************** Abridged CPAN Log ********************************************** <snip> Running [/usr/bin/make test]... PERL_DL_NONLAZY=1 /usr/bin/perl "-MExtUtils::Command::MM" "-e" "test_harness(0, 'blib/lib', 'blib/arch')" t/*.t t/as.t .............. ok t/blessed.t ......... ok t/dogpound.t ........ ok # Failed test ''-' hashkeys' # at t/test_helper.pl line 253. # Failed test 'hashkeys with newlines' # at t/test_helper.pl line 253. # Looks like you failed 2 tests of 49. t/dump.t ............ Dubious, test returned 2 (wstat 512, 0x200) Failed 2/49 subtests (less 2 skipped subtests: 45 okay) t/filter.t .......... ok t/globtest.t ........ ok t/hardrefs.t ........ ok t/impure_madness.t .. ok # # PadWalker 1.9 is installed t/lexicals.t ........ ok t/locked.t .......... ok t/madness.t ......... ok t/madness_w.t ....... ok t/names.t ........... ok t/overload.t ........ ok t/readonly.t ........ ok t/refaddr.t ......... ok t/refcount.t ........ ok t/refelem.t ......... ok t/reftype.t ......... ok t/sortkeys.t ........ ok t/tree.t ............ ok t/usage.t ........... ok t/xs_subs.t ......... ok Test Summary Report ------------------- t/dump.t (Wstat: 512 Tests: 49 Failed: 2) Failed tests: 48-49 Non-zero exit status: 2 Files=23, Tests=362, 3 wallclock secs ( 0.06 usr 0.01 sys + 2.70 cusr 0.31 csys = 3.08 CPU) Result: FAIL Failed 1/23 test programs. 2/362 subtests failed. make: *** [test_dynamic] Error 255 [ERROR] MAKE TEST failed: No such file or directory PERL_DL_NONLAZY=1 /usr/bin/perl "-MExtUtils::Command::MM" "-e" "test_harness(0, 'blib/lib', 'blib/arch')" t/*.t t/as.t .............. ok t/blessed.t ......... ok t/dogpound.t ........ ok # Failed test ''-' hashkeys' # at t/test_helper.pl line 253. # Failed test 'hashkeys with newlines' # at t/test_helper.pl line 253. # Looks like you failed 2 tests of 49. t/dump.t ............ Dubious, test returned 2 (wstat 512, 0x200) Failed 2/49 subtests (less 2 skipped subtests: 45 okay) t/filter.t .......... ok t/globtest.t ........ ok t/hardrefs.t ........ ok t/impure_madness.t .. ok # # PadWalker 1.9 is installed t/lexicals.t ........ ok t/locked.t .......... ok t/madness.t ......... ok t/madness_w.t ....... ok t/names.t ........... ok t/overload.t ........ ok t/readonly.t ........ ok t/refaddr.t ......... ok t/refcount.t ........ ok t/refelem.t ......... ok t/reftype.t ......... ok t/sortkeys.t ........ ok t/tree.t ............ ok t/usage.t ........... ok t/xs_subs.t ......... ok Test Summary Report ------------------- t/dump.t (Wstat: 512 Tests: 49 Failed: 2) Failed tests: 48-49 Non-zero exit status: 2 Files=23, Tests=362, 3 wallclock secs ( 0.06 usr 0.01 sys + 2.70 cusr 0.31 csys = 3.08 CPU) Result: FAIL Failed 1/23 test programs. 2/362 subtests failed. make: *** [test_dynamic] Error 255 The tests for 'Data::Dump::Streamer' failed. Would you like me to proceed anyway or should we abort? Proceed anyway? [y/N]: N [ERROR] Unable to create a new distribution object for 'Data::Dump::Streamer' -- cannot continue [ERROR] Failed to install 'Data::Dump::Streamer' as prerequisite for 'Devel::REPL' [ERROR] Unable to satisfy prerequisites for 'Devel::REPL' -- aborting install [ERROR] Unable to create a new distribution object for 'Devel::REPL' -- cannot continue *** Install log written to: /home/tss/.cpanplus/install-logs/Devel-REPL-1.003007-1257847793.log Error installing 'Devel::REPL' Problem installing one or more modules *** You can view the complete error buffer by pressing 'p' *** CPAN Terminal> **** EOF ****
Subject: Devel-REPL-1.003007-1257847793.log
Resolved with 2.14


This service is sponsored and maintained by Best Practical Solutions and runs on Perl.org infrastructure.

Please report any issues with rt.cpan.org to rt-cpan-admin@bestpractical.com.