Skip Menu |
 

This queue is for tickets about the DBD-mysql CPAN distribution.

Report information
The Basics
Id: 510
Status: resolved
Priority: 0/
Queue: DBD-mysql

People
Owner: Nobody in particular
Requestors: chicks [...] chicks.net
Cc:
AdminCc:

Bug Information
Severity: Important
Broken in: 2.1014
Fixed in: (no value)



Subject: many tests fail
Download (untitled) / with headers
text/plain 5.1k
make test fails. Using DBI 1.21 on Red Hat 7.2 with the following modules installed: # rpm -qa | egrep -i '(mysql|perl)' | sort gimp-perl-1.2.1-7 groff-perl-1.17.2-7.0.2 mod_perl-1.26-2 MySQL-3.23.49a-1 MySQL-client-3.23.49a-1 MySQL-devel-3.23.49a-1 MySQL-shared-3.23.49a-1 openssl-perl-0.9.6b-8 perl-5.6.1-26.72.3 perl-CGI-2.752-26.72.3 perl-CPAN-1.59_54-26.72.3 perl-DateManip-5.39-5 perl-DB_File-1.75-26.72.3 perl-Digest-MD5-2.13-1 perl-HTML-Parser-3.25-2 perl-HTML-Tagset-3.03-3 perl-libnet-1.0703-6 perl-libwww-perl-5.53-3 perl-libxml-enno-1.02-5 perl-libxml-perl-0.07-5 perl-MIME-Base64-2.12-6 perl-NDBM_File-1.75-26.72.3 perl-Parse-Yapp-1.04-3 perl-SGMLSpm-1.03ii-4 perl-Storable-0.6.11-6 perl-URI-1.12-5 perl-XML-Dumper-0.4-5 perl-XML-Encoding-1.01-2 perl-XML-Grove-0.46alpha-3 perl-XML-Parser-2.30-7 perl-XML-Twig-2.02-2 rpm-perl-4.0.4-7x # perl -V Summary of my perl5 (revision 5.0 version 6 subversion 1) configuration: Platform: osname=linux, osvers=2.4.17-0.13smp, archname=i386-linux uname='linux daffy.perf.redhat.com 2.4.17-0.13smp #1 smp fri feb 1 10:30:48 est 2002 i686 unknown ' config_args='-des -Doptimize=-O2 -march=i386 -mcpu=i686 -Dcc=gcc -Dcf_by=Red Hat, Inc. -Dcccdlflags=-fPIC -Dinstallprefix=/usr -Dprefix=/usr -Darchname=i386-linux -Uusethreads -Uuseithreads -Uuselargefiles -Dd_dosuid -Dd_semctl_semun -Di_db -Di_ndbm -Di_gdbm -Di_shadow -Di_syslog -Dman3ext=3pm -Dlocincpth=' hint=recommended, useposix=true, d_sigaction=define usethreads=undef use5005threads=undef useithreads=undef usemultiplicity=undef useperlio=undef d_sfio=undef uselargefiles=undef usesocks=undef use64bitint=undef use64bitall=undef uselongdouble=undef Compiler: cc='gcc', ccflags ='-fno-strict-aliasing -I/usr/local/include', optimize='-O2 -march=i386 -mcpu=i686', cppflags='-fno-strict-aliasing -I/usr/local/include' ccversion='', gccversion='2.96 20000731 (Red Hat Linux 7.1 2.96-98)', gccosandvers='' intsize=4, longsize=4, ptrsize=4, doublesize=8, byteorder=1234 d_longlong=define, longlongsize=8, d_longdbl=define, longdblsize=12 ivtype='long', ivsize=4, nvtype='double', nvsize=8, Off_t='off_t', lseeksize=4 alignbytes=4, usemymalloc=n, prototype=define Linker and Libraries: ld='gcc', ldflags =' -L/usr/local/lib' libpth=/usr/local/lib /lib /usr/lib libs=-lnsl -ldl -lm -lc -lcrypt -lutil perllibs=-lnsl -ldl -lm -lc -lcrypt -lutil libc=/lib/libc-2.2.4.so, so=so, useshrplib=false, libperl=libperl.a Dynamic Linking: dlsrc=dl_dlopen.xs, dlext=so, d_dlsymun=undef, ccdlflags='-rdynamic' cccdlflags='-fPIC', lddlflags='-shared -L/usr/local/lib' Characteristics of this binary (from libperl): Compile-time options: Built under linux Compiled at Feb 20 2002 15:01:16 @INC: /usr/lib/perl5/5.6.1/i386-linux /usr/lib/perl5/5.6.1 /usr/lib/perl5/site_perl/5.6.1/i386-linux /usr/lib/perl5/site_perl/5.6.1 /usr/lib/perl5/site_perl/5.6.0/i386-linux /usr/lib/perl5/site_perl/5.6.0 /usr/lib/perl5/site_perl . the error output is: PERL_DL_NONLAZY=1 /usr/bin/perl -Iblib/arch -Iblib/lib -I/usr/lib/perl5/5.6.1/i386-linux -I/usr/lib/perl5/5.6.1 -e 'use Test::Harness qw(&runtests $verbose); $verbose=0; runtests @ARGV;' t/*.t t/00base...........ok t/10dsnlist........ok t/20createdrop.....ok t/30insertfetch....ok t/40bindparam......ok t/40blobs..........ok t/40listfields.....ok t/40nulls..........ok t/40numrows........ok t/50chopblanks.....ok t/50commit.........ok, 14/30 skipped: No transactions t/60leaks..........skipped test on this platform t/ak-dbd...........ok t/akmisc...........FAILED test 44 Failed 1/351 tests, 99.72% okay t/dbdadmin.........dubious Test returned status 0 (wstat 11, 0xb) DIED. FAILED tests 5-20 Failed 16/20 tests, 20.00% okay t/insertid.........ok t/mysql2...........ok t/mysql............FAILED test 23 Failed 1/68 tests, 98.53% okay Failed Test Stat Wstat Total Fail Failed List of Failed ------------------------------------------------------------------------------- t/akmisc.t 351 1 0.28% 44 t/dbdadmin.t 0 11 20 16 80.00% 5-20 t/mysql.t 68 1 1.47% 23 1 test and 14 subtests skipped. Failed 3/18 test scripts, 83.33% okay. 18/764 subtests failed, 97.64% okay. make: *** [test_dynamic] Error 9


This service is sponsored and maintained by Best Practical Solutions and runs on Perl.org infrastructure.

Please report any issues with rt.cpan.org to rt-cpan-admin@bestpractical.com.