Skip Menu |
 

This queue is for tickets about the TheSchwartz CPAN distribution.

Report information
The Basics
Id: 48533
Status: resolved
Priority: 0/
Queue: TheSchwartz

People
Owner: Nobody in particular
Requestors: aliustek [...] gmail.com
Cc:
AdminCc:

Bug Information
Severity: Critical
Broken in: 1.07
Fixed in: (no value)



Subject: nmake test fails on win32
Download (untitled) / with headers
text/plain 106b
unlink on windows can't unlink the db files as they still have connections perl v.5.10.0 on Windows XP SP3
Subject: TheSchwartz.log
Download TheSchwartz.log
text/plain 7k
Microsoft (R) Program Maintenance Utility Version 1.50 Copyright (c) Microsoft Corp 1988-94. All rights reserved. C:\Perl\bin\perl.exe "-Iinc" -MExtUtils::Command -e cp bin/schwartzmon blib\script\schwartzmon pl2bat.bat blib\script\schwartzmon C:\Perl\bin\perl.exe "-MExtUtils::Command::MM" "-e" "test_harness(0, 'inc', 'blib\lib', 'blib\arch')" t/05-job-ctor.t t/api.t t/cleanup.t t/client-ti me-unsync.t t/coalesce.t t/dead-dbs.t t/empty-db.t t/evenly-distribute.t t/fail-working-multiple.t t/funcid.t t/grab-race.t t/high-funcid-starvation.t t/inse rt-and-do.t t/parallel-workers.t t/pod-coverage.t t/pod.t t/priority.t t/replace-with.t t/retry-delay.t t/scoreboard.t t/server-time.t t/unique.t t/work-befo re-funcids-exist.t t/05-job-ctor..................ok t/api..........................ok 88/108# Looks like you planned 108 tests but ran 96. t/api..........................dubious Test returned status 255 (wstat 65280, 0xff00) DIED. FAILED tests 97-108 Failed 12/108 tests, 88.89% okay (less 42 skipped tests: 54 okay, 50.00%) t/cleanup......................ok 18/20Can't teardown ts1: Permission denied at t/lib/db-common.pl line 153. # Looks like your test exited with 13 just after 20. t/cleanup......................dubious Test returned status 13 (wstat 3328, 0xd00) after all the subtests completed successfully t/client-time-unsync...........No such signal: SIGUSR1 at t/client-time-unsync.t line 26. No such signal: SIGUSR2 at t/client-time-unsync.t line 27. t/client-time-unsync...........ok 2/2 skipped: various reasons t/coalesce.....................ok 27/28Can't teardown ts1: Permission denied at t/lib/db-common.pl line 153. # Looks like your test exited with 13 just after 28. t/coalesce.....................dubious Test returned status 13 (wstat 3328, 0xd00) after all the subtests completed successfully t/dead-dbs.....................ok 2/4 skipped: various reasons t/empty-db.....................ok 3/6 skipped: various reasons t/evenly-distribute............ok 4/8 skipped: various reasons t/fail-working-multiple........ok 7/8Can't teardown ts1: Permission denied at t/lib/db-common.pl line 153. # Looks like your test exited with 13 just after 8. t/fail-working-multiple........dubious Test returned status 13 (wstat 3328, 0xd00) after all the subtests completed successfully t/funcid.......................ok 8/16 skipped: various reasons t/grab-race....................No such signal: SIGUSR1 at t/grab-race.t line 16. t/grab-race....................ok 2/2 skipped: various reasons t/high-funcid-starvation.......ok 4/8 skipped: various reasons t/insert-and-do................ok 47/52Can't teardown ts1: Permission denied at t/lib/db-common.pl line 153. # Looks like your test exited with 13 just after 52. t/insert-and-do................dubious Test returned status 13 (wstat 3328, 0xd00) after all the subtests completed successfully t/parallel-workers.............No such signal: SIGUSR1 at t/parallel-workers.t line 15. No such signal: SIGUSR2 at t/parallel-workers.t line 16. t/parallel-workers.............ok 2/2 skipped: various reasons t/pod-coverage.................ok 1/3 t/pod-coverage.................NOK 3/3# Failed test 'Pod coverage on TheSchwartz' # at t/pod-coverage.t line 27. # Coverage for TheSchwartz is 78.3%, with 5 naked subroutines: # clean_scoreboard # end_scoreboard # scoreboard # set_scoreboard # start_scoreboard # Looks like you failed 1 test of 3. t/pod-coverage.................dubious Test returned status 1 (wstat 256, 0x100) DIED. FAILED test 3 Failed 1/3 tests, 66.67% okay t/pod..........................skipped all skipped: Test::Pod 1.00 required for testing POD t/priority.....................ok 61/62Can't teardown ts1: Permission denied at t/lib/db-common.pl line 153. # Looks like your test exited with 13 just after 62. t/priority.....................dubious Test returned status 13 (wstat 3328, 0xd00) after all the subtests completed successfully t/replace-with.................ok 17/20Can't teardown ts1: Permission denied at t/lib/db-common.pl line 153. # Looks like your test exited with 13 just after 20. t/replace-with.................dubious Test returned status 13 (wstat 3328, 0xd00) after all the subtests completed successfully t/retry-delay..................ok 13/16Can't teardown ts1: Permission denied at t/lib/db-common.pl line 153. # Looks like your test exited with 13 just after 16. t/retry-delay..................dubious Test returned status 13 (wstat 3328, 0xd00) after all the subtests completed successfully t/scoreboard...................ok 1/20Can't create scoreboard directory '/tmp/theschwartz': No such file or directory at C:\Perl\cpan\build\TheSchwartz-1.07- p4LEyQ\blib\lib/TheSchwartz.pm line 623. # Looks like you planned 20 tests but ran 10. # Looks like your test exited with 2 just after 10. t/scoreboard...................dubious Test returned status 2 (wstat 512, 0x200) DIED. FAILED tests 11-20 Failed 10/20 tests, 50.00% okay (less 10 skipped tests: 0 okay, 0.00%) t/server-time..................ok 5/4Can't teardown ts1: Permission denied at t/lib/db-common.pl line 153. # Looks like you planned 4 tests but ran 6. # Looks like your test exited with 13 just after 6. t/server-time..................dubious Test returned status 13 (wstat 3328, 0xd00) DIED. FAILED tests 5-6 Failed 2/4 tests, 50.00% okay (less 4 skipped tests: -2 okay, -50.00%) t/unique.......................ok 6/12 skipped: various reasons t/work-before-funcids-exist....ok 2/4 skipped: various reasons Failed Test Stat Wstat Total Fail List of Failed ------------------------------------------------------------------------------- t/api.t 255 65280 108 24 97-108 t/cleanup.t 13 3328 20 0 ?? t/coalesce.t 13 3328 28 0 ?? t/fail-working-multiple.t 13 3328 8 0 ?? t/insert-and-do.t 13 3328 52 0 ?? t/pod-coverage.t 1 256 3 1 3 t/priority.t 13 3328 62 0 ?? t/replace-with.t 13 3328 20 0 ?? t/retry-delay.t 13 3328 16 0 ?? t/scoreboard.t 2 512 20 20 11-20 t/server-time.t 13 3328 4 2 5-6 1 test and 194 subtests skipped. Failed 11/23 test scripts. 21/424 subtests failed. Files=23, Tests=424, 70 wallclock secs ( 0.00 cusr + 0.00 csys = 0.00 CPU) Failed 11/23 test programs. 21/424 subtests failed. NMAKE : fatal error U1077: 'C:\WINDOWS\system32\cmd.exe' : return code '0xff' Stop. BRADFITZ/TheSchwartz-1.07.tar.gz nmake test -- NOT OK //hint// to see the cpan-testers results for installing this module, try: reports BRADFITZ/TheSchwartz-1.07.tar.gz Running make install make test had returned bad status, won't install without force
Fixed


This service is sponsored and maintained by Best Practical Solutions and runs on Perl.org infrastructure.

Please report any issues with rt.cpan.org to rt-cpan-admin@bestpractical.com.