Skip Menu |
 

Preferred bug tracker

Please visit the preferred bug tracker to report your issue.

This queue is for tickets about the Graphics-Primitive-Driver-Cairo CPAN distribution.

Report information
The Basics
Id: 48323
Status: new
Priority: 0/
Queue: Graphics-Primitive-Driver-Cairo

People
Owner: Nobody in particular
Requestors: perl [...] david-raab.de
Cc:
AdminCc:

Bug Information
Severity: Critical
Broken in: 0.39
Fixed in: (no value)



Subject: Tests only runs as expeted when Test::PDF is not installed
Download (untitled) / with headers
text/plain 116b
The tests for your Modul runs only when "Test::PDF" is not installed. If Test::PDF is installed the testsuite fails.
Subject: error.txt
Download error.txt
text/plain 2.8k
Installing Graphics::Primitive::Driver::Cairo (0.39) ==> MISSING Signature file! <== Running [/home/sidburn/perl510/bin/perl /home/sidburn/perl510/bin/cpanp-run-perl /home/sidburn/.cpanplus/5.10.0/build/Graphics-Primitive-Driver-Cairo-0.39/Makefile.PL]... Cannot determine perl version info from lib/Graphics/Primitive/Driver/Cairo.pm Writing Makefile for Graphics::Primitive::Driver::Cairo Running [/usr/bin/make test]... PERL_DL_NONLAZY=1 /home/sidburn/perl510/bin/perl "-MExtUtils::Command::MM" "-e" "test_harness(0, 'inc', 'blib/lib', 'blib/arch')" t/*.t # Testing Graphics::Primitive::Driver::Cairo 0.39, Perl 5.010000, /home/sidburn/perl510/bin/perl t/00-load.t ............ ok t/10-complex-border.t .. skipped: (DISABLED) Test::PDF required for testing output testing # Failed test 'simple border' # at t/10-simple-border.t line 36. # Looks like you failed 1 test of 1. t/10-simple-border.t ... Dubious, test returned 1 (wstat 256, 0x100) Failed 1/1 subtests t/20-layout.t .......... ok # Failed test 'margin w/background' # at t/30-margin-back.t line 37. # Looks like you failed 1 test of 1. t/30-margin-back.t ..... Dubious, test returned 1 (wstat 256, 0x100) Failed 1/1 subtests Test Summary Report ------------------- t/10-simple-border.t (Wstat: 256 Tests: 1 Failed: 1) Failed test: 1 Non-zero exit status: 1 t/30-margin-back.t (Wstat: 256 Tests: 1 Failed: 1) Failed test: 1 Non-zero exit status: 1 Files=5, Tests=9, 5 wallclock secs ( 0.02 usr 0.01 sys + 3.60 cusr 0.31 csys = 3.94 CPU) Result: FAIL Failed 2/5 test programs. 2/9 subtests failed. make: *** [test_dynamic] Error 1 [ERROR] MAKE TEST failed: Bad file descriptor PERL_DL_NONLAZY=1 /home/sidburn/perl510/bin/perl "-MExtUtils::Command::MM" "-e" "test_harness(0, 'inc', 'blib/lib', 'blib/arch')" t/*.t # Testing Graphics::Primitive::Driver::Cairo 0.39, Perl 5.010000, /home/sidburn/perl510/bin/perl t/00-load.t ............ ok t/10-complex-border.t .. skipped: (DISABLED) Test::PDF required for testing output testing # Failed test 'simple border' # at t/10-simple-border.t line 36. # Looks like you failed 1 test of 1. t/10-simple-border.t ... Dubious, test returned 1 (wstat 256, 0x100) Failed 1/1 subtests t/20-layout.t .......... ok # Failed test 'margin w/background' # at t/30-margin-back.t line 37. # Looks like you failed 1 test of 1. t/30-margin-back.t ..... Dubious, test returned 1 (wstat 256, 0x100) Failed 1/1 subtests Test Summary Report ------------------- t/10-simple-border.t (Wstat: 256 Tests: 1 Failed: 1) Failed test: 1 Non-zero exit status: 1 t/30-margin-back.t (Wstat: 256 Tests: 1 Failed: 1) Failed test: 1 Non-zero exit status: 1 Files=5, Tests=9, 5 wallclock secs ( 0.02 usr 0.01 sys + 3.60 cusr 0.31 csys = 3.94 CPU) Result: FAIL Failed 2/5 test programs. 2/9 subtests failed. make: *** [test_dynamic] Error 1


This service is sponsored and maintained by Best Practical Solutions and runs on Perl.org infrastructure.

Please report any issues with rt.cpan.org to rt-cpan-admin@bestpractical.com.