This queue is for tickets about the XML-Twig CPAN distribution.

Report information
The Basics
Id:
4708
Status:
resolved
Priority:
Low/Low
Queue:

People
Owner:
Nobody in particular
Requestors:
muenalan [...] cpan.org
Cc:
AdminCc:

BugTracker
Severity:
Normal
Broken in:
3.11
Fixed in:
(no value)



Subject: FAIL perl580/Win32: Weak reference not implemented (but installs either?=)
I prior installed WeakRef successfully. XML::Twig installs even tests fail. This detected this because it gets obvious when one install AI::ExpertSystem::Simple (which uses X::T). Which perl version should work (> 5.8.0) ?? Or win32 prob ? Murat --- CPAN.pm: Going to build M/MI/MIROD/XML-Twig-3.11.tar.gz Do you want to install 'xml_pp' (XML pretty printer)? [y] Do you want to install 'xml_grep' (XML grep - grep XML files using XML::Twig's subset of expat)? [y] Do you want to install 'xml_spellcheck' (spellcheck XML files skipping tags)? [y] Checking if your kit is complete... Looks good Writing Makefile for XML::Twig Microsoft (R) Program Maintenance Utility Version 7.00.9466 Copyright (C) Microsoft Corporation. All rights reserved. echo "building Twig.pm" "building Twig.pm" C:\Programme\Perl\bin\perl.exe speedup Twig.pm.slow > Twig.pm perl version is 5.008 XML::Parser version is 2.31 C:\Programme\Perl\bin\perl.exe check_optional_modules cp Twig.pm blib\lib\XML\Twig.pm C:\Programme\Perl\bin\perl.exe -MExtUtils::Command -e cp tools/xml_grep/xml_grep blib\script\xml_grep pl2bat.bat blib\script\xml_grep C:\Programme\Perl\bin\perl.exe -MExtUtils::Command -e cp tools/xml_pp/xml_pp blib\script\xml_pp pl2bat.bat blib\script\xml_pp C:\Programme\Perl\bin\perl.exe -MExtUtils::Command -e cp tools/xml_spellcheck/xml_spellcheck blib\script\xml_spellcheck pl2bat.bat blib\script\xml_spellcheck "C:\Programme\Microsoft Visual Studio .NET\FrameworkSDK\Bin\nmake.exe" -- OK Running make test Microsoft (R) Program Maintenance Utility Version 7.00.9466 Copyright (C) Microsoft Corporation. All rights reserved. Skip blib\lib\XML\Twig.pm (unchanged) C:\Programme\Perl\bin\perl.exe -MExtUtils::Command -e cp tools/xml_grep/xml_grep blib\script\xml_grep pl2bat.bat blib\script\xml_grep C:\Programme\Perl\bin\perl.exe -MExtUtils::Command -e cp tools/xml_pp/xml_pp blib\script\xml_pp pl2bat.bat blib\script\xml_pp C:\Programme\Perl\bin\perl.exe -MExtUtils::Command -e cp tools/xml_spellcheck/xml_spellcheck blib\script\xml_spellcheck pl2bat.bat blib\script\xml_spellcheck C:\Programme\Perl\bin\perl.exe "-MExtUtils::Command::MM" "-e" "test_harness(0, 'blib\lib', 'blib\arch')" t\is_field.t t\test1.t t\test2.t t\test3.t t\test4.t t\test5.t t\test_at tregexp_cond.t t\test_cdata.t t\test_comment_handler.t t\test_drop_comments.t t\test_entities.t t\test_erase.t t\test_ignore_elts.t t\test_nav.t t\test_pi_handler.t t\test_pos.t t\test_ spaces.t t\test_twig_roots.t t\test_variables.t t\test_xpath_cond.t t\is_field................Weak references are not implemented in the version of perl at V:\.cpan\build\XML-Twig-3.11\blib\lib/XML/Twig.pm line 95 BEGIN failed--compilation aborted at V:\.cpan\build\XML-Twig-3.11\blib\lib/XML/Twig.pm line 139. Compilation failed in require at t\is_field.t line 4. BEGIN failed--compilation aborted at t\is_field.t line 4. t\is_field................dubious Test returned status 255 (wstat 65280, 0xff00) t\test1...................Weak references are not implemented in the version of perl at V:\.cpan\build\XML-Twig-3.11\blib\lib/XML/Twig.pm line 95 BEGIN failed--compilation aborted at V:\.cpan\build\XML-Twig-3.11\blib\lib/XML/Twig.pm line 139. Compilation failed in require at t\test1.t line 11. BEGIN failed--compilation aborted at t\test1.t line 11. t\test1...................dubious Test returned status 255 (wstat 65280, 0xff00) t\test2...................Weak references are not implemented in the version of perl at V:\.cpan\build\XML-Twig-3.11\blib\lib/XML/Twig.pm line 95 BEGIN failed--compilation aborted at V:\.cpan\build\XML-Twig-3.11\blib\lib/XML/Twig.pm line 139. Compilation failed in require at t\test2.t line 10. BEGIN failed--compilation aborted at t\test2.t line 10. t\test2...................dubious Test returned status 255 (wstat 65280, 0xff00) t\test3...................Weak references are not implemented in the version of perl at V:\.cpan\build\XML-Twig-3.11\blib\lib/XML/Twig.pm line 95 BEGIN failed--compilation aborted at V:\.cpan\build\XML-Twig-3.11\blib\lib/XML/Twig.pm line 139. Compilation failed in require at t\test3.t line 13. BEGIN failed--compilation aborted at t\test3.t line 13. t\test3...................dubious Test returned status 255 (wstat 65280, 0xff00) t\test4...................Weak references are not implemented in the version of perl at V:\.cpan\build\XML-Twig-3.11\blib\lib/XML/Twig.pm line 95 BEGIN failed--compilation aborted at V:\.cpan\build\XML-Twig-3.11\blib\lib/XML/Twig.pm line 139. Compilation failed in require at t\test4.t line 8. BEGIN failed--compilation aborted at t\test4.t line 8. t\test4...................dubious Test returned status 255 (wstat 65280, 0xff00) t\test5...................Weak references are not implemented in the version of perl at V:\.cpan\build\XML-Twig-3.11\blib\lib/XML/Twig.pm line 95 BEGIN failed--compilation aborted at V:\.cpan\build\XML-Twig-3.11\blib\lib/XML/Twig.pm line 139. Compilation failed in require at t\test5.t line 4. BEGIN failed--compilation aborted at t\test5.t line 4. t\test5...................dubious Test returned status 255 (wstat 65280, 0xff00) t\test_attregexp_cond.....Weak references are not implemented in the version of perl at V:\.cpan\build\XML-Twig-3.11\blib\lib/XML/Twig.pm line 95 BEGIN failed--compilation aborted at V:\.cpan\build\XML-Twig-3.11\blib\lib/XML/Twig.pm line 139. Compilation failed in require at t\test_attregexp_cond.t line 4. BEGIN failed--compilation aborted at t\test_attregexp_cond.t line 4. t\test_attregexp_cond.....dubious Test returned status 255 (wstat 65280, 0xff00) t\test_cdata..............Weak references are not implemented in the version of perl at V:\.cpan\build\XML-Twig-3.11\blib\lib/XML/Twig.pm line 95 BEGIN failed--compilation aborted at V:\.cpan\build\XML-Twig-3.11\blib\lib/XML/Twig.pm line 139. Compilation failed in require at t\test_cdata.t line 6. BEGIN failed--compilation aborted at t\test_cdata.t line 6. t\test_cdata..............dubious Test returned status 255 (wstat 65280, 0xff00) t\test_comment_handler....Weak references are not implemented in the version of perl at V:\.cpan\build\XML-Twig-3.11\blib\lib/XML/Twig.pm line 95 BEGIN failed--compilation aborted at V:\.cpan\build\XML-Twig-3.11\blib\lib/XML/Twig.pm line 139. Compilation failed in require at t\test_comment_handler.t line 7. BEGIN failed--compilation aborted at t\test_comment_handler.t line 7. t\test_comment_handler....dubious Test returned status 255 (wstat 65280, 0xff00) t\test_drop_comments......Weak references are not implemented in the version of perl at V:\.cpan\build\XML-Twig-3.11\blib\lib/XML/Twig.pm line 95 BEGIN failed--compilation aborted at V:\.cpan\build\XML-Twig-3.11\blib\lib/XML/Twig.pm line 139. Compilation failed in require at t\test_drop_comments.t line 3. BEGIN failed--compilation aborted at t\test_drop_comments.t line 3. t\test_drop_comments......dubious Test returned status 255 (wstat 65280, 0xff00) t\test_entities...........Weak references are not implemented in the version of perl at V:\.cpan\build\XML-Twig-3.11\blib\lib/XML/Twig.pm line 95 BEGIN failed--compilation aborted at V:\.cpan\build\XML-Twig-3.11\blib\lib/XML/Twig.pm line 139. Compilation failed in require at t\test_entities.t line 5. BEGIN failed--compilation aborted at t\test_entities.t line 5. t\test_entities...........dubious Test returned status 255 (wstat 65280, 0xff00) t\test_erase..............Weak references are not implemented in the version of perl at V:\.cpan\build\XML-Twig-3.11\blib\lib/XML/Twig.pm line 95 BEGIN failed--compilation aborted at V:\.cpan\build\XML-Twig-3.11\blib\lib/XML/Twig.pm line 139. Compilation failed in require at t\test_erase.t line 4. BEGIN failed--compilation aborted at t\test_erase.t line 4. t\test_erase..............dubious Test returned status 255 (wstat 65280, 0xff00) t\test_ignore_elts........Weak references are not implemented in the version of perl at V:\.cpan\build\XML-Twig-3.11\blib\lib/XML/Twig.pm line 95 BEGIN failed--compilation aborted at V:\.cpan\build\XML-Twig-3.11\blib\lib/XML/Twig.pm line 139. Compilation failed in require at t\test_ignore_elts.t line 4. BEGIN failed--compilation aborted at t\test_ignore_elts.t line 4. t\test_ignore_elts........dubious Test returned status 255 (wstat 65280, 0xff00) t\test_nav................Weak references are not implemented in the version of perl at V:\.cpan\build\XML-Twig-3.11\blib\lib/XML/Twig.pm line 95 BEGIN failed--compilation aborted at V:\.cpan\build\XML-Twig-3.11\blib\lib/XML/Twig.pm line 139. Compilation failed in require at t\test_nav.t line 7. BEGIN failed--compilation aborted at t\test_nav.t line 7. t\test_nav................dubious Test returned status 255 (wstat 65280, 0xff00) t\test_pi_handler.........Weak references are not implemented in the version of perl at V:\.cpan\build\XML-Twig-3.11\blib\lib/XML/Twig.pm line 95 BEGIN failed--compilation aborted at V:\.cpan\build\XML-Twig-3.11\blib\lib/XML/Twig.pm line 139. Compilation failed in require at t\test_pi_handler.t line 9. BEGIN failed--compilation aborted at t\test_pi_handler.t line 9. t\test_pi_handler.........dubious Test returned status 255 (wstat 65280, 0xff00) t\test_pos................Weak references are not implemented in the version of perl at V:\.cpan\build\XML-Twig-3.11\blib\lib/XML/Twig.pm line 95 BEGIN failed--compilation aborted at V:\.cpan\build\XML-Twig-3.11\blib\lib/XML/Twig.pm line 139. Compilation failed in require at t\test_pos.t line 9. BEGIN failed--compilation aborted at t\test_pos.t line 9. t\test_pos................dubious Test returned status 255 (wstat 65280, 0xff00) t\test_spaces.............Weak references are not implemented in the version of perl at V:\.cpan\build\XML-Twig-3.11\blib\lib/XML/Twig.pm line 95 BEGIN failed--compilation aborted at V:\.cpan\build\XML-Twig-3.11\blib\lib/XML/Twig.pm line 139. Compilation failed in require at t\test_spaces.t line 3. BEGIN failed--compilation aborted at t\test_spaces.t line 3. t\test_spaces.............dubious Test returned status 255 (wstat 65280, 0xff00) t\test_twig_roots.........Weak references are not implemented in the version of perl at V:\.cpan\build\XML-Twig-3.11\blib\lib/XML/Twig.pm line 95 BEGIN failed--compilation aborted at V:\.cpan\build\XML-Twig-3.11\blib\lib/XML/Twig.pm line 139. Compilation failed in require at t\test_twig_roots.t line 5. BEGIN failed--compilation aborted at t\test_twig_roots.t line 5. t\test_twig_roots.........dubious Test returned status 255 (wstat 65280, 0xff00) t\test_variables..........Weak references are not implemented in the version of perl at V:\.cpan\build\XML-Twig-3.11\blib\lib/XML/Twig.pm line 95 BEGIN failed--compilation aborted at V:\.cpan\build\XML-Twig-3.11\blib\lib/XML/Twig.pm line 139. Compilation failed in require at t\test_variables.t line 4. BEGIN failed--compilation aborted at t\test_variables.t line 4. t\test_variables..........dubious Test returned status 255 (wstat 65280, 0xff00) t\test_xpath_cond.........Weak references are not implemented in the version of perl at V:\.cpan\build\XML-Twig-3.11\blib\lib/XML/Twig.pm line 95 BEGIN failed--compilation aborted at V:\.cpan\build\XML-Twig-3.11\blib\lib/XML/Twig.pm line 139. Compilation failed in require at t\test_xpath_cond.t line 4. BEGIN failed--compilation aborted at t\test_xpath_cond.t line 4. t\test_xpath_cond.........dubious Test returned status 255 (wstat 65280, 0xff00) FAILED--20 test scripts could be run, alas--no output ever seen NMAKE : fatal error U1077: 'C:\Programme\Perl\bin\perl.exe' : return code '0x2' Stop. "C:\Programme\Microsoft Visual Studio .NET\FrameworkSDK\Bin\nmake.exe" test -- NOT OK Running make install Microsoft (R) Program Maintenance Utility Version 7.00.9466 Copyright (C) Microsoft Corporation. All rights reserved. Skip blib\lib\XML\Twig.pm (unchanged) C:\Programme\Perl\bin\perl.exe -MExtUtils::Command -e cp tools/xml_grep/xml_grep blib\script\xml_grep pl2bat.bat blib\script\xml_grep C:\Programme\Perl\bin\perl.exe -MExtUtils::Command -e cp tools/xml_pp/xml_pp blib\script\xml_pp pl2bat.bat blib\script\xml_pp C:\Programme\Perl\bin\perl.exe -MExtUtils::Command -e cp tools/xml_spellcheck/xml_spellcheck blib\script\xml_spellcheck pl2bat.bat blib\script\xml_spellcheck Writing C:\Programme\Perl\site\lib\auto\XML\Twig\.packlist Appending installation info to C:\Programme\Perl\lib/perllocal.pod "C:\Programme\Microsoft Visual Studio .NET\FrameworkSDK\Bin\nmake.exe" install UNINST=1 -- OK
From: muenalan@cpan.org
[guest - Thu Dec 18 12:12:21 2003]: after reading the FAQ *cough* and reinstalling Scalar::Util it still shows the same problem. Murat
Show quoted text
> I prior installed WeakRef successfully. > > XML::Twig installs even tests fail. > > This detected this because it gets obvious when one install > AI::ExpertSystem::Simple (which uses X::T). > > Which perl version should work (> 5.8.0) ?? Or win32 prob ? > > Murat > > --- > > CPAN.pm: Going to build M/MI/MIROD/XML-Twig-3.11.tar.gz > > Do you want to install 'xml_pp' (XML pretty printer)? [y] > Do you want to install 'xml_grep' (XML grep - grep XML files using > XML::Twig's subset of expat)? [y] > Do you want to install 'xml_spellcheck' (spellcheck XML files
skipping
Show quoted text
> tags)? [y] > Checking if your kit is complete... > Looks good > Writing Makefile for XML::Twig > > Microsoft (R) Program Maintenance Utility Version 7.00.9466 > Copyright (C) Microsoft Corporation. All rights reserved. > > echo "building Twig.pm" > "building Twig.pm" > C:\Programme\Perl\bin\perl.exe speedup Twig.pm.slow > Twig.pm > perl version is 5.008 XML::Parser version is 2.31 > C:\Programme\Perl\bin\perl.exe check_optional_modules > cp Twig.pm blib\lib\XML\Twig.pm > C:\Programme\Perl\bin\perl.exe -MExtUtils::Command -e cp > tools/xml_grep/xml_grep blib\script\xml_grep > pl2bat.bat blib\script\xml_grep > C:\Programme\Perl\bin\perl.exe -MExtUtils::Command -e cp > tools/xml_pp/xml_pp blib\script\xml_pp > pl2bat.bat blib\script\xml_pp > C:\Programme\Perl\bin\perl.exe -MExtUtils::Command -e cp > tools/xml_spellcheck/xml_spellcheck blib\script\xml_spellcheck > pl2bat.bat blib\script\xml_spellcheck > "C:\Programme\Microsoft Visual Studio > .NET\FrameworkSDK\Bin\nmake.exe" -- OK > Running make test > > Microsoft (R) Program Maintenance Utility Version 7.00.9466 > Copyright (C) Microsoft Corporation. All rights reserved. > > Skip blib\lib\XML\Twig.pm (unchanged) > C:\Programme\Perl\bin\perl.exe -MExtUtils::Command -e cp > tools/xml_grep/xml_grep blib\script\xml_grep > pl2bat.bat blib\script\xml_grep > C:\Programme\Perl\bin\perl.exe -MExtUtils::Command -e cp > tools/xml_pp/xml_pp blib\script\xml_pp > pl2bat.bat blib\script\xml_pp > C:\Programme\Perl\bin\perl.exe -MExtUtils::Command -e cp > tools/xml_spellcheck/xml_spellcheck blib\script\xml_spellcheck > pl2bat.bat blib\script\xml_spellcheck > C:\Programme\Perl\bin\perl.exe "-MExtUtils::Command::MM" "-e" > "test_harness(0, 'blib\lib', 'blib\arch')" t\is_field.t t\test1.t > t\test2.t t\test3.t t\test4.t t\test5.t t\test_at > tregexp_cond.t t\test_cdata.t t\test_comment_handler.t > t\test_drop_comments.t t\test_entities.t t\test_erase.t > t\test_ignore_elts.t t\test_nav.t t\test_pi_handler.t t\test_pos.t > t\test_ > spaces.t t\test_twig_roots.t t\test_variables.t t\test_xpath_cond.t > t\is_field................Weak references are not implemented in the > version of perl at V:\.cpan\build\XML-Twig-3.11\blib\lib/XML/Twig.pm > line 95 > BEGIN failed--compilation aborted at V:\.cpan\build\XML-Twig- > 3.11\blib\lib/XML/Twig.pm line 139. > Compilation failed in require at t\is_field.t line 4. > BEGIN failed--compilation aborted at t\is_field.t line 4. > t\is_field................dubious > Test returned status 255 (wstat 65280, 0xff00) > t\test1...................Weak references are not implemented in the > version of perl at V:\.cpan\build\XML-Twig-3.11\blib\lib/XML/Twig.pm > line 95 > BEGIN failed--compilation aborted at V:\.cpan\build\XML-Twig- > 3.11\blib\lib/XML/Twig.pm line 139. > Compilation failed in require at t\test1.t line 11. > BEGIN failed--compilation aborted at t\test1.t line 11. > t\test1...................dubious > Test returned status 255 (wstat 65280, 0xff00) > t\test2...................Weak references are not implemented in the > version of perl at V:\.cpan\build\XML-Twig-3.11\blib\lib/XML/Twig.pm > line 95 > BEGIN failed--compilation aborted at V:\.cpan\build\XML-Twig- > 3.11\blib\lib/XML/Twig.pm line 139. > Compilation failed in require at t\test2.t line 10. > BEGIN failed--compilation aborted at t\test2.t line 10. > t\test2...................dubious > Test returned status 255 (wstat 65280, 0xff00) > t\test3...................Weak references are not implemented in the > version of perl at V:\.cpan\build\XML-Twig-3.11\blib\lib/XML/Twig.pm > line 95 > BEGIN failed--compilation aborted at V:\.cpan\build\XML-Twig- > 3.11\blib\lib/XML/Twig.pm line 139. > Compilation failed in require at t\test3.t line 13. > BEGIN failed--compilation aborted at t\test3.t line 13. > t\test3...................dubious > Test returned status 255 (wstat 65280, 0xff00) > t\test4...................Weak references are not implemented in the > version of perl at V:\.cpan\build\XML-Twig-3.11\blib\lib/XML/Twig.pm > line 95 > BEGIN failed--compilation aborted at V:\.cpan\build\XML-Twig- > 3.11\blib\lib/XML/Twig.pm line 139. > Compilation failed in require at t\test4.t line 8. > BEGIN failed--compilation aborted at t\test4.t line 8. > t\test4...................dubious > Test returned status 255 (wstat 65280, 0xff00) > t\test5...................Weak references are not implemented in the > version of perl at V:\.cpan\build\XML-Twig-3.11\blib\lib/XML/Twig.pm > line 95 > BEGIN failed--compilation aborted at V:\.cpan\build\XML-Twig- > 3.11\blib\lib/XML/Twig.pm line 139. > Compilation failed in require at t\test5.t line 4. > BEGIN failed--compilation aborted at t\test5.t line 4. > t\test5...................dubious > Test returned status 255 (wstat 65280, 0xff00) > t\test_attregexp_cond.....Weak references are not implemented in the > version of perl at V:\.cpan\build\XML-Twig-3.11\blib\lib/XML/Twig.pm > line 95 > BEGIN failed--compilation aborted at V:\.cpan\build\XML-Twig- > 3.11\blib\lib/XML/Twig.pm line 139. > Compilation failed in require at t\test_attregexp_cond.t line 4. > BEGIN failed--compilation aborted at t\test_attregexp_cond.t line 4. > t\test_attregexp_cond.....dubious > Test returned status 255 (wstat 65280, 0xff00) > t\test_cdata..............Weak references are not implemented in the > version of perl at V:\.cpan\build\XML-Twig-3.11\blib\lib/XML/Twig.pm > line 95 > BEGIN failed--compilation aborted at V:\.cpan\build\XML-Twig- > 3.11\blib\lib/XML/Twig.pm line 139. > Compilation failed in require at t\test_cdata.t line 6. > BEGIN failed--compilation aborted at t\test_cdata.t line 6. > t\test_cdata..............dubious > Test returned status 255 (wstat 65280, 0xff00) > t\test_comment_handler....Weak references are not implemented in the > version of perl at V:\.cpan\build\XML-Twig-3.11\blib\lib/XML/Twig.pm > line 95 > BEGIN failed--compilation aborted at V:\.cpan\build\XML-Twig- > 3.11\blib\lib/XML/Twig.pm line 139. > Compilation failed in require at t\test_comment_handler.t line 7. > BEGIN failed--compilation aborted at t\test_comment_handler.t line 7. > t\test_comment_handler....dubious > Test returned status 255 (wstat 65280, 0xff00) > t\test_drop_comments......Weak references are not implemented in the > version of perl at V:\.cpan\build\XML-Twig-3.11\blib\lib/XML/Twig.pm > line 95 > BEGIN failed--compilation aborted at V:\.cpan\build\XML-Twig- > 3.11\blib\lib/XML/Twig.pm line 139. > Compilation failed in require at t\test_drop_comments.t line 3. > BEGIN failed--compilation aborted at t\test_drop_comments.t line 3. > t\test_drop_comments......dubious > Test returned status 255 (wstat 65280, 0xff00) > t\test_entities...........Weak references are not implemented in the > version of perl at V:\.cpan\build\XML-Twig-3.11\blib\lib/XML/Twig.pm > line 95 > BEGIN failed--compilation aborted at V:\.cpan\build\XML-Twig- > 3.11\blib\lib/XML/Twig.pm line 139. > Compilation failed in require at t\test_entities.t line 5. > BEGIN failed--compilation aborted at t\test_entities.t line 5. > t\test_entities...........dubious > Test returned status 255 (wstat 65280, 0xff00) > t\test_erase..............Weak references are not implemented in the > version of perl at V:\.cpan\build\XML-Twig-3.11\blib\lib/XML/Twig.pm > line 95 > BEGIN failed--compilation aborted at V:\.cpan\build\XML-Twig- > 3.11\blib\lib/XML/Twig.pm line 139. > Compilation failed in require at t\test_erase.t line 4. > BEGIN failed--compilation aborted at t\test_erase.t line 4. > t\test_erase..............dubious > Test returned status 255 (wstat 65280, 0xff00) > t\test_ignore_elts........Weak references are not implemented in the > version of perl at V:\.cpan\build\XML-Twig-3.11\blib\lib/XML/Twig.pm > line 95 > BEGIN failed--compilation aborted at V:\.cpan\build\XML-Twig- > 3.11\blib\lib/XML/Twig.pm line 139. > Compilation failed in require at t\test_ignore_elts.t line 4. > BEGIN failed--compilation aborted at t\test_ignore_elts.t line 4. > t\test_ignore_elts........dubious > Test returned status 255 (wstat 65280, 0xff00) > t\test_nav................Weak references are not implemented in the > version of perl at V:\.cpan\build\XML-Twig-3.11\blib\lib/XML/Twig.pm > line 95 > BEGIN failed--compilation aborted at V:\.cpan\build\XML-Twig- > 3.11\blib\lib/XML/Twig.pm line 139. > Compilation failed in require at t\test_nav.t line 7. > BEGIN failed--compilation aborted at t\test_nav.t line 7. > t\test_nav................dubious > Test returned status 255 (wstat 65280, 0xff00) > t\test_pi_handler.........Weak references are not implemented in the > version of perl at V:\.cpan\build\XML-Twig-3.11\blib\lib/XML/Twig.pm > line 95 > BEGIN failed--compilation aborted at V:\.cpan\build\XML-Twig- > 3.11\blib\lib/XML/Twig.pm line 139. > Compilation failed in require at t\test_pi_handler.t line 9. > BEGIN failed--compilation aborted at t\test_pi_handler.t line 9. > t\test_pi_handler.........dubious > Test returned status 255 (wstat 65280, 0xff00) > t\test_pos................Weak references are not implemented in the > version of perl at V:\.cpan\build\XML-Twig-3.11\blib\lib/XML/Twig.pm > line 95 > BEGIN failed--compilation aborted at V:\.cpan\build\XML-Twig- > 3.11\blib\lib/XML/Twig.pm line 139. > Compilation failed in require at t\test_pos.t line 9. > BEGIN failed--compilation aborted at t\test_pos.t line 9. > t\test_pos................dubious > Test returned status 255 (wstat 65280, 0xff00) > t\test_spaces.............Weak references are not implemented in the > version of perl at V:\.cpan\build\XML-Twig-3.11\blib\lib/XML/Twig.pm > line 95 > BEGIN failed--compilation aborted at V:\.cpan\build\XML-Twig- > 3.11\blib\lib/XML/Twig.pm line 139. > Compilation failed in require at t\test_spaces.t line 3. > BEGIN failed--compilation aborted at t\test_spaces.t line 3. > t\test_spaces.............dubious > Test returned status 255 (wstat 65280, 0xff00) > t\test_twig_roots.........Weak references are not implemented in the > version of perl at V:\.cpan\build\XML-Twig-3.11\blib\lib/XML/Twig.pm > line 95 > BEGIN failed--compilation aborted at V:\.cpan\build\XML-Twig- > 3.11\blib\lib/XML/Twig.pm line 139. > Compilation failed in require at t\test_twig_roots.t line 5. > BEGIN failed--compilation aborted at t\test_twig_roots.t line 5. > t\test_twig_roots.........dubious > Test returned status 255 (wstat 65280, 0xff00) > t\test_variables..........Weak references are not implemented in the > version of perl at V:\.cpan\build\XML-Twig-3.11\blib\lib/XML/Twig.pm > line 95 > BEGIN failed--compilation aborted at V:\.cpan\build\XML-Twig- > 3.11\blib\lib/XML/Twig.pm line 139. > Compilation failed in require at t\test_variables.t line 4. > BEGIN failed--compilation aborted at t\test_variables.t line 4. > t\test_variables..........dubious > Test returned status 255 (wstat 65280, 0xff00) > t\test_xpath_cond.........Weak references are not implemented in the > version of perl at V:\.cpan\build\XML-Twig-3.11\blib\lib/XML/Twig.pm > line 95 > BEGIN failed--compilation aborted at V:\.cpan\build\XML-Twig- > 3.11\blib\lib/XML/Twig.pm line 139. > Compilation failed in require at t\test_xpath_cond.t line 4. > BEGIN failed--compilation aborted at t\test_xpath_cond.t line 4. > t\test_xpath_cond.........dubious > Test returned status 255 (wstat 65280, 0xff00) > FAILED--20 test scripts could be run, alas--no output ever seen > NMAKE : fatal error U1077: 'C:\Programme\Perl\bin\perl.exe' : return > code '0x2' > Stop. > "C:\Programme\Microsoft Visual Studio > .NET\FrameworkSDK\Bin\nmake.exe" test -- NOT OK > Running make install > > Microsoft (R) Program Maintenance Utility Version 7.00.9466 > Copyright (C) Microsoft Corporation. All rights reserved. > > Skip blib\lib\XML\Twig.pm (unchanged) > C:\Programme\Perl\bin\perl.exe -MExtUtils::Command -e cp > tools/xml_grep/xml_grep blib\script\xml_grep > pl2bat.bat blib\script\xml_grep > C:\Programme\Perl\bin\perl.exe -MExtUtils::Command -e cp > tools/xml_pp/xml_pp blib\script\xml_pp > pl2bat.bat blib\script\xml_pp > C:\Programme\Perl\bin\perl.exe -MExtUtils::Command -e cp > tools/xml_spellcheck/xml_spellcheck blib\script\xml_spellcheck > pl2bat.bat blib\script\xml_spellcheck > Writing C:\Programme\Perl\site\lib\auto\XML\Twig\.packlist > Appending installation info to C:\Programme\Perl\lib/perllocal.pod > "C:\Programme\Microsoft Visual Studio > .NET\FrameworkSDK\Bin\nmake.exe" install UNINST=1 -- OK
Date: Thu, 18 Dec 2003 20:00:39 +0100 (CET)
From: Michel Rodriguez <mirod@xmltwig.com>
To: Guest via RT <bug-XML-Twig@rt.cpan.org>
Subject: Re: [cpan #4708] FAIL perl580/Win32: Weak reference not implemented (but installs either?=)
RT-Send-Cc:
On Thu, 18 Dec 2003, Guest via RT wrote:
Show quoted text
> after reading the FAQ *cough* and reinstalling Scalar::Util it still > shows the same problem.
Did you re-run perl Makefile.pl after reinstalling Scalar::Util? -- Michel Rodriguez Perl &amp; XML http://www.xmltwig.com


This service runs on Request Tracker, is sponsored by The Perl Foundation, and maintained by Best Practical Solutions.

Please report any issues with rt.cpan.org to rt-cpan-admin@bestpractical.com.