Skip Menu |
 

This queue is for tickets about the PHP-Strings CPAN distribution.

Report information
The Basics
Id: 4590
Status: open
Priority: 0/
Queue: PHP-Strings

People
Owner: moxliukas [...] delfi.lt
Requestors: Jost.Krieger+smokeback [...] sunu991.rz.ruhr-uni-bochum.de
Cc:
AdminCc:

Bug Information
Severity: Important
Broken in: (no value)
Fixed in: (no value)



Date: 6 Dec 2003 10:15:53 -0000
Subject: FAIL PHP-Strings-0.25 sun4-solaris 2.8
From: Jost.Krieger+smokeback [...] sunu991.rz.ruhr-uni-bochum.de (Jost Krieger)
To: cpan-testers [...] perl.org
CC: SPOON [...] cpan.org
This distribution has been tested as part of the cpan-testers effort to test as many new uploads to CPAN as possible. See http://testers.cpan.org/ Please cc any replies to cpan-testers@perl.org to keep other test volunteers informed and to prevent any duplicate effort. -- This is an error report generated automatically by CPANPLUS, version 0.047. Below is the error stack during 'make test': PERL_DL_NONLAZY=1 /usr/local/perl-5.8.1/bin/perl "-MExtUtils::Command::MM" "-e" "test_harness(0, 'blib/lib', 'blib/arch')" t/*.t t/addcslashes.....# Failed test (t/addcslashes.t at line 18) # '1 parameter was passed to PHP::Strings::addcslashes but 2 were expected # Params::Validate::__ANON__('1 parameter was passed to PHP::Strings::addcslashes but 2 wer...') called at /usr/local/perl-5.8.1/lib/site_perl/5.8.1/Params/ValidatePP.pm line 105 # Params::Validate::validate_pos('ARRAY(0x25bc5c)','HASH(0x1dfbd8)','HASH(0x1dfbd8)') called at /net/sunu991/disc1/.cpanplus/5.8.1/build/PHP-Strings-0.25/blib/lib/PHP/Strings.pm line 176 # PHP::Strings::addcslashes('undef') called at t/addcslashes.t line 17 # eval {...} called at t/addcslashes.t line 17 # ' # doesn't match '(?-xism:^Parameter #1.*undef.*scalar)' # Looks like you failed 1 tests of 7. dubious Test returned status 1 (wstat 256, 0x100) DIED. FAILED test 5 Failed 1/7 tests, 85.71% okay t/addslashes......ok t/bin2hex.........ok t/chunk_split.....ok t/count_chars.....ok t/money_format....# Failed test (t/money_format.t at line 14) # got: '1234.56' # expected: 'USD 1,234.56' # Failed test (t/money_format.t at line 17) # got: '1234.56' # expected: 'EUR 1.234,56' # Failed test (t/money_format.t at line 23) # got: '( 1234.57)' # expected: '($ 1,234.57)' # Failed test (t/money_format.t at line 26) # got: '(******1234.57)' # expected: '($********1,234.57)' # Failed test (t/money_format.t at line 30) # got: ' DEM ****1234,56' # expected: ' 1234,56**** EUR' # Failed test (t/money_format.t at line 36) # got: 'The final value is DEM 1.234,56 (after a 10% discount)' # expected: 'The final value is GBP 1,234.56 (after a 10% discount)' # Failed test (t/money_format.t at line 68) # '1 parameter was passed to PHP::Strings::money_format but at least 2 were expected # Params::Validate::__ANON__('1 parameter was passed to PHP::Strings::money_format but at l...') called at /usr/local/perl-5.8.1/lib/site_perl/5.8.1/Params/ValidatePP.pm line 105 # Params::Validate::validate_pos('ARRAY(0x2a1a34)','HASH(0x258b9c)','HASH(0x24815c)') called at /usr/local/perl-5.8.1/lib/site_perl/5.8.1/Params/ValidatePP.pm line 374 # Params::Validate::validate_with('params','ARRAY(0x2a1a34)','allow_extra',1,'spec','ARRAY(0x2a18fc)') called at /net/sunu991/disc1/.cpanplus/5.8.1/build/PHP-Strings-0.25/blib/lib/PHP/Strings.pm line 973 # PHP::Strings::money_format('undef') called at t/money_format.t line 67 # eval {...} called at t/money_format.t line 67 # ' # doesn't match '(?-xism:^Parameter #1.*undef.*scalar)' # Looks like you failed 7 tests of 12. dubious Test returned status 7 (wstat 1792, 0x700) DIED. FAILED tests 2-7, 10 Failed 7/12 tests, 41.67% okay t/str_pad.........# Failed test (t/str_pad.t at line 21) # '1 parameter was passed to PHP::Strings::str_pad but 2 - 4 were expected # Params::Validate::__ANON__('1 parameter was passed to PHP::Strings::str_pad but 2 - 4 wer...') called at /usr/local/perl-5.8.1/lib/site_perl/5.8.1/Params/ValidatePP.pm line 105 # Params::Validate::validate_pos('ARRAY(0x27c7e4)','HASH(0x1e0360)','HASH(0x22b4a0)','HASH(0x250260)','HASH(0x250828)') called at /net/sunu991/disc1/.cpanplus/5.8.1/build/PHP-Strings-0.25/blib/lib/PHP/Strings.pm line 1453 # PHP::Strings::str_pad('undef') called at t/str_pad.t line 20 # eval {...} called at t/str_pad.t line 20 # ' # doesn't match '(?-xism:^Parameter #1.*undef.*scalar)' # Looks like you failed 1 tests of 12. dubious Test returned status 1 (wstat 256, 0x100) DIED. FAILED test 8 Failed 1/12 tests, 91.67% okay Failed 3/7 test scripts, 57.14% okay. 9/58 subtests failed, 84.48% okay. Failed Test Stat Wstat Total Fail Failed List of Failed ------------------------------------------------------------------------------- t/addcslashes.t 1 256 7 1 14.29% 5 t/money_format.t 7 1792 12 7 58.33% 2-7 10 t/str_pad.t 1 256 12 1 8.33% 8 make: *** [test_dynamic] Error 2 Additional comments: -- Summary of my perl5 (revision 5.0 version 8 subversion 1) configuration: Platform: osname=solaris, osvers=2.8, archname=sun4-solaris uname='sunos sunu991 5.8 generic_108528-14 sun4u sparc sunw,ultra-5_10 solaris ' config_args='' hint=recommended, useposix=true, d_sigaction=define usethreads=undef use5005threads=undef useithreads=undef usemultiplicity=undef useperlio=define d_sfio=undef uselargefiles=define usesocks=undef use64bitint=undef use64bitall=undef uselongdouble=undef usemymalloc=n, bincompat5005=undef Compiler: cc='gcc', ccflags ='-fno-strict-aliasing -I/usr/local/include -D_LARGEFILE_SOURCE -D_FILE_OFFSET_BITS=64', optimize='-O', cppflags='-fno-strict-aliasing -I/usr/local/include' ccversion='', gccversion='3.0.3', gccosandvers='solaris2.8' intsize=4, longsize=4, ptrsize=4, doublesize=8, byteorder=4321 d_longlong=define, longlongsize=8, d_longdbl=define, longdblsize=16 ivtype='long', ivsize=4, nvtype='double', nvsize=8, Off_t='off_t', lseeksize=8 alignbytes=8, prototype=define Linker and Libraries: ld='gcc', ldflags =' -L/usr/local/lib ' libpth=/usr/local/lib /usr/lib /usr/ccs/lib libs=-lsocket -lnsl -lgdbm -ldb -ldl -lm -lc perllibs=-lsocket -lnsl -ldl -lm -lc libc=/lib/libc.so, so=so, useshrplib=false, libperl=libperl.a gnulibc_version='' Dynamic Linking: dlsrc=dl_dlopen.xs, dlext=so, d_dlsymun=undef, ccdlflags=' -z ignore -z lazyload -z combreloc' cccdlflags='-fPIC', lddlflags=' -G -z ignore -z lazyload -z combreloc -L/usr/local/lib'


This service is sponsored and maintained by Best Practical Solutions and runs on Perl.org infrastructure.

Please report any issues with rt.cpan.org to rt-cpan-admin@bestpractical.com.