Skip Menu |
 

This queue is for tickets about the Template-Plugin-Autoformat CPAN distribution.

Report information
The Basics
Id: 41796
Status: resolved
Priority: 0/
Queue: Template-Plugin-Autoformat

People
Owner: karman [...] cpan.org
Requestors: frank.wiegand [...] gmail.com
Cc:
AdminCc:

Bug Information
Severity: (no value)
Broken in: 2.71
Fixed in: (no value)



Subject: test failure: t/autoform.t
Template::Plugin::Autoformat does not pass its test suite: % perl Makefile.PL Writing Makefile for Template-Plugin-Autoformat % make Manifying blib/man3/Template::Plugin::Autoformat.3pm % make test PERL_DL_NONLAZY=1 /usr/bin/perl "-MExtUtils::Command::MM" "-e" "test_harness(0, 'blib/lib', 'blib/arch')" t/autoform.t t/autoform....1/25 FAILED 23: - template text 10 did not match expected FAILED 25: - template text 11 did not match expected t/autoform.... Failed 2/25 subtests Test Summary Report ------------------- t/autoform (Wstat: 0 Tests: 25 Failed: 2) Failed tests: 23, 25 Files=1, Tests=25, 0 wallclock secs ( 0.04 usr 0.00 sys + 0.15 cusr 0.00 csys = 0.19 CPU) Result: FAIL Failed 1/1 test programs. 2/25 subtests failed. make: *** [test_dynamic] Fehler 255 % perl -Iblib t/autoform.t 1..25 ok 1 - running test_expect() ok 2 - template processor is engaged ok 3 - input read and split into 11 tests ok 4 - template text 1 processed OK: [% global.text = BLOCK %]\nThis i... ok 5 - template text 1 matched expected ok 6 - template text 2 processed OK: [% USE autoformat(left=5) %]\n[% ... ok 7 - template text 2 matched expected ok 8 - template text 3 processed OK: [% USE autoformat %]\n[% autoform... ok 9 - template text 3 matched expected ok 10 - template text 4 processed OK: [% USE autoformat(left=10) %]\n[%... ok 11 - template text 4 matched expected ok 12 - template text 5 processed OK: [% USE autoformat(left=5) %]\n[% ... ok 13 - template text 5 matched expected ok 14 - template text 6 processed OK: [% USE autoformat %]\n[% FILTER a... ok 15 - template text 6 matched expected ok 16 - template text 7 processed OK: [% USE autoformat %]\n[% autoform... ok 17 - template text 7 matched expected ok 18 - template text 8 processed OK: [% USE autoformat %]\n[% autoform... ok 19 - template text 8 matched expected ok 20 - template text 9 processed OK: [% USE autoformat %]\n[% FILTER p... ok 21 - template text 9 matched expected ok 22 - template text 10 processed OK: Item Description C... MATCH FAILED input: [Item Description Cost =================================== [% form = BLOCK %] <<<<<< [[[[[[[[[[[[[[[ >>>>.<< [% END -%] [% USE autoformat(form => form) %] [% autoformat('foo', 'The Foo Item', 123.545) %] [% autoformat('bar', 'The Bar Item', 456.789) %] ] expect: [Item Description Cost =================================== foo The Foo Item 123.55 bar The Bar Item 456.79] output: [Item Description Cost =================================== foo The Foo Item 123,00 bar The Bar Item 456,79] FAILED 23: - template text 10 did not match expected not ok 23 - template text 10 did not match expected ok 24 - template text 11 processed OK: [% USE autoformat(form => '>>>.<... MATCH FAILED input: [[% USE autoformat(form => '>>>.<<', numeric => 'AllPlaces') %] [% autoformat(n) FOREACH n = [ 123, 34.54, 99 ] +%] [% autoformat(987, 654.32) %] ] expect: [123.00 34.54 99.00 987.00 654.32] output: [123,00 34,54 99,00 987,00 654,32] FAILED 25: - template text 11 did not match expected not ok 25 - template text 11 did not match expected % perl -V Summary of my perl5 (revision 5 version 10 subversion 0) configuration: Platform: osname=linux, osvers=2.6.26-1-vserver-amd64, archname=x86_64-linux-gnu-thread-multi uname='linux excelsior 2.6.26-1-vserver-amd64 #1 smp sat nov 8 20:24:14 utc 2008 x86_64 gnulinux ' config_args='-Dusethreads -Duselargefiles -Dccflags=-DDEBIAN -Dcccdlflags=-fPIC -Darchname=x86_64-linux-gnu -Dprefix=/usr -Dprivlib=/usr/share/perl/5.10 -Darchlib=/usr/lib/perl/5.10 -Dvendorprefix=/usr -Dvendorlib=/usr/share/perl5 -Dvendorarch=/usr/lib/perl5 -Dsiteprefix=/usr/local -Dsitelib=/usr/local/share/perl/5.10.0 -Dsitearch=/usr/local/lib/perl/5.10.0 -Dman1dir=/usr/share/man/man1 -Dman3dir=/usr/share/man/man3 -Dsiteman1dir=/usr/local/man/man1 -Dsiteman3dir=/usr/local/man/man3 -Dman1ext=1 -Dman3ext=3perl -Dpager=/usr/bin/sensible-pager -Uafs -Ud_csh -Ud_ualarm -Uusesfio -Uusenm -DDEBUGGING=-g -Doptimize=-O2 -Duseshrplib -Dlibperl=libperl.so.5.10.0 -Dd_dosuid -des' hint=recommended, useposix=true, d_sigaction=define useithreads=define, usemultiplicity=define useperlio=define, d_sfio=undef, uselargefiles=define, usesocks=undef use64bitint=define, use64bitall=define, uselongdouble=undef usemymalloc=n, bincompat5005=undef Compiler: cc='cc', ccflags ='-D_REENTRANT -D_GNU_SOURCE -DDEBIAN -fno-strict-aliasing -pipe -I/usr/local/include -D_LARGEFILE_SOURCE -D_FILE_OFFSET_BITS=64', optimize='-O2 -g', cppflags='-D_REENTRANT -D_GNU_SOURCE -DDEBIAN -fno-strict-aliasing -pipe -I/usr/local/include' ccversion='', gccversion='4.3.2', gccosandvers='' intsize=4, longsize=8, ptrsize=8, doublesize=8, byteorder=12345678 d_longlong=define, longlongsize=8, d_longdbl=define, longdblsize=16 ivtype='long', ivsize=8, nvtype='double', nvsize=8, Off_t='off_t', lseeksize=8 alignbytes=8, prototype=define Linker and Libraries: ld='cc', ldflags =' -L/usr/local/lib' libpth=/usr/local/lib /lib /usr/lib /lib64 /usr/lib64 libs=-lgdbm -lgdbm_compat -ldb -ldl -lm -lpthread -lc -lcrypt perllibs=-ldl -lm -lpthread -lc -lcrypt libc=/lib/libc-2.7.so, so=so, useshrplib=true, libperl=libperl.so.5.10.0 gnulibc_version='2.7' Dynamic Linking: dlsrc=dl_dlopen.xs, dlext=so, d_dlsymun=undef, ccdlflags='-Wl,-E' cccdlflags='-fPIC', lddlflags='-shared -O2 -g -L/usr/local/lib' Characteristics of this binary (from libperl): Compile-time options: MULTIPLICITY PERL_DONT_CREATE_GVSV PERL_IMPLICIT_CONTEXT PERL_MALLOC_WRAP USE_64_BIT_ALL USE_64_BIT_INT USE_ITHREADS USE_LARGE_FILES USE_PERLIO USE_REENTRANT_API Built under linux Compiled at Nov 27 2008 21:47:49 %ENV: PERL_AUTOINSTALL="--defaultdeps" PERL_EXTUTILS_AUTOINSTALL="--defaultdeps" PERL_MM_USE_DEFAULT="1" @INC: /etc/perl /usr/local/lib/perl/5.10.0 /usr/local/share/perl/5.10.0 /usr/lib/perl5 /usr/share/perl5 /usr/lib/perl/5.10 /usr/share/perl/5.10 /usr/local/lib/site_perl . Thanks, Frank
Subject: Re: [rt.cpan.org #41796] test failure: t/autoform.t
Date: Thu, 18 Dec 2008 08:22:38 +0000
To: bug-Template-Plugin-Autoformat [...] rt.cpan.org
From: Andy Wardley <abw [...] wardley.org>
Download (untitled) / with headers
text/plain 111b
Hi Frank, What locale are you using? I thought I had accounted for different locales, but obviously not. A
Subject: Re: [rt.cpan.org #41796] test failure: t/autoform.t
Date: Thu, 18 Dec 2008 09:34:47 +0100
To: bug-Template-Plugin-Autoformat [...] rt.cpan.org
From: Frank Wiegand <frank.wiegand [...] gmail.com>
Download (untitled) / with headers
text/plain 881b
Am Donnerstag, den 18.12.2008, 03:22 -0500 schrieb Andy Wardley via RT: Show quoted text
> <URL: http://rt.cpan.org/Ticket/Display.html?id=41796 > > What locale are you using? I thought I had accounted for different > locales, but obviously not.
de_DE.UTF-8, yes, it's a locale issue: % LANG=de_DE.UTF-8 prove -b t/autoform.t t/autoform....1/25 FAILED 23: - template text 10 did not match expected FAILED 25: - template text 11 did not match expected t/autoform.... Failed 2/25 subtests Test Summary Report ------------------- t/autoform (Wstat: 0 Tests: 25 Failed: 2) Failed tests: 23, 25 Files=1, Tests=25, 0 wallclock secs ( 0.04 usr 0.00 sys + 0.16 cusr 0.00 csys = 0.20 CPU) Result: FAIL % LANG=C prove -b t/autoform.t t/autoform....ok All tests successful. Files=1, Tests=25, 0 wallclock secs ( 0.03 usr 0.00 sys + 0.16 cusr 0.00 csys = 0.19 CPU) Result: PASS Bye, Frank
Download (untitled) / with headers
text/plain 509b
I have taken over maintenance of this module. Since so much time has passed and I don't have a repo history, I can't really tell if this issue has been addressed or not. I see locale testing in the t/autoform.t file which seems to indicate some effort has been made to address the issue. Version 2.74_01 has been uploaded to PAUSE, which fixes the case problems in the plugin detection by standardizing on initial cap spelling. I will wait for cpantesters to tell me whether it also fixes this locale issue.
Download (untitled) / with headers
text/plain 140b
2.75 just uploaded to CPAN should fix this particular test. It was caused by a rounding discrepancy in sprintf() in the Test::Reform module.


This service is sponsored and maintained by Best Practical Solutions and runs on Perl.org infrastructure.

Please report any issues with rt.cpan.org to rt-cpan-admin@bestpractical.com.