Skip Menu |

This queue is for tickets about the Net-Services CPAN distribution.

Report information
The Basics
Id: 324
Status: resolved
Priority: 0/
Queue: Net-Services

Owner: Nobody in particular
Requestors: arnaud [...]

Bug Information
Severity: (no value)
Broken in: (no value)
Fixed in: (no value)

Date: Fri, 8 Mar 2002 12:29:31 +0100
From: ASSAD Arnaud <arnaud [...]>
Subject: FAIL Net-Services-1.2 i386-linux 2.4.8-11mdkenterprise
To: cpan-testers [...]
Cc: bug-Net-Services [...]
Download (untitled) / with headers
text/plain 3.4k
This distribution has been tested as part of the cpan-testers effort to test as many new uploads to CPAN as possible. See Please cc any replies to to keep other test volunteers informed and to prevent any duplicate effort. -- PERL_DL_NONLAZY=1 /usr/bin/perl -Iblib/arch -Iblib/lib -I/usr/lib/perl5/5.6.1/i386-linux -I/usr/lib/perl5/5.6.1 -e 'use Test::Harness qw(&runtests $verbose); $verbose=1; runtests @ARGV;' t/*.t t/doc.....1..1 not ok 1 - POD Coverage inadequate: 0 # Failed test (t/doc.t at line 15) # Looks like you failed 1 tests of 1. dubious Test returned status 1 (wstat 256, 0x100) DIED. FAILED test 1 Failed 1/1 tests, 0.00% okay t/info....1..5 ok 1 - Package name matches ok 2 - Version is a version number ok 3 - Module is correctly not in core ok 4 - Package matches ok 5 - Module requirements match ok t/test....1..1 not ok 1 - use Net::Services; # Failed test (t/test.t at line 8) # Tried to use 'Net::Services'. # Error: Inappropriate line: 14 # [ 0/tcp Reserved] # Compilation failed in require at (eval 1) line 2, <GEN0> line 14. # Looks like you failed 1 tests of 1. dubious Test returned status 1 (wstat 256, 0x100) DIED. FAILED test 1 Failed 1/1 tests, 0.00% okay Failed Test Stat Wstat Total Fail Failed List of Failed ------------------------------------------------------------------------------- t/doc.t 1 256 1 1 100.00% 1 t/test.t 1 256 1 1 100.00% 1 Failed 2/3 test scripts, 33.33% okay. 2/7 subtests failed, 71.43% okay. make: *** [test_dynamic] Erreur 9 -- Summary of my perl5 (revision 5.0 version 6 subversion 1) configuration: Platform: osname=linux, osvers=2.4.8-11mdkenterprise, archname=i386-linux uname='linux 2.4.8-11mdkenterprise #1 smp wed aug 22 16:05:18 cest 2001 i686 unknown ' config_args='-des -Darchname=i386-linux -Dd_dosuid -Ud_csh -Duseshrplib -Doptimize=-O3 -fomit-frame-pointer -pipe -mcpu=pentiumpro -march=i586 -ffast-math -fno-strength-reduce -Dprefix=/usr -Di_ndbm -Di_gdbm -Di_shadow -Di_syslog -Uuselargefiles -Dman1dir=/usr/share/man/man1 -Dman3dir=/usr/lib/perl5/man/man3' hint=recommended, useposix=true, d_sigaction=define usethreads=undef use5005threads=undef useithreads=undef usemultiplicity=undef useperlio=undef d_sfio=undef uselargefiles=undef usesocks=undef use64bitint=undef use64bitall=undef uselongdouble=undef Compiler: cc='cc', ccflags ='-fno-strict-aliasing', optimize='-O3 -fomit-frame-pointer -pipe -mcpu=pentiumpro -march=i586 -ffast-math -fno-strength-reduce', cppflags='-fno-strict-aliasing' ccversion='', gccversion='2.96 20000731 (Mandrake Linux 8.1 2.96-0.62mdk)', gccosandvers='' intsize=4, longsize=4, ptrsize=4, doublesize=8, byteorder=1234 d_longlong=define, longlongsize=8, d_longdbl=define, longdblsize=12 ivtype='long', ivsize=4, nvtype='double', nvsize=8, Off_t='off_t', lseeksize=4 alignbytes=4, usemymalloc=n, prototype=define Linker and Libraries: ld='cc', ldflags =' -L/usr/local/lib' libpth=/usr/local/lib /lib /usr/lib libs=-lnsl -ldl -lm -lc -lcrypt -lutil perllibs=-lnsl -ldl -lm -lc -lcrypt -lutil libc=/lib/, so=so, useshrplib=true, Dynamic Linking: dlsrc=dl_dlopen.xs, dlext=so, d_dlsymun=undef, ccdlflags='-rdynamic -Wl,-rpath,/usr/lib/perl5/5.6.1/i386-linux/CORE' cccdlflags='-fpic', lddlflags='-shared -L/usr/local/lib'
Download (untitled) / with headers
text/plain 164b
[ - Thu Mar 7 05:33:47 2002]: Fixed in Net::Services 1.3 (to be uploaded in the next few days, depending on other bugs). Ta for the report.

This service is sponsored and maintained by Best Practical Solutions and runs on infrastructure.

Please report any issues with to