This queue is for tickets about the CPAN CPAN distribution.

Report information
The Basics
Id:
31750
Status:
open
Priority:
Low/Low
Queue:

People
Owner:
Nobody in particular
Requestors:
frank [...] planet-interview.de
Cc:
AdminCc:

BugTracker
Severity:
Important
Broken in:
1.9205
Fixed in:
(no value)



Subject: t/31sessions.t fails on 1.9205 and 1.92_53

Message body is not shown because it is too large.

From: kwilliams@cpan.org
I'm getting the same errors on one of my boxes too, I've tried 1.9205, 1.9204, 1.9203, 1.9202, and 1.90 with essentially the same results as Frank reported. -Ken
By the way, the tests for CPAN 1.88 do pass on this system. -Ken
From: frank.wiegand@gmail.com
On Do. 20. Dez. 2007, 17:56:00, KWILLIAMS wrote:
Show quoted text
> By the way, the tests for CPAN 1.88 do pass on this system. > > -Ken >
Yes, me too. But on 1.88 there was no 31sessions.t. 1.88_67 introduced it. Versions up to 1.88_66 do not have the problem. 31session.t from 1.88_67 hangs (forever, as I can see). 31session.t from 1.88_68: fw@cu-pontos:~/Downloads/CPAN-1.88_68$ prove -Ilib t/31sessions.t t/31sessions......# DEBUG: name[first]system["/usr/bin/perl" "-I/home/fw/Downloads/CPAN-1.88_68/t" "-Mblib" "-MCPAN::MyConfig" "-MCPAN" "-e" "@CPAN::Defaultsites = (); shell" > test.out] at t/31sessions.t line 142. The following failure is intentional in order to trigger the corresponding action of the installer program on distros with failing tests Failed 1/1 test programs. 1/2 subtests failed. The following failure is intentional in order to trigger the corresponding action of the installer program on distros with failing tests Failed 1/1 test programs. 1/2 subtests failed. t/31sessions......1/? # Failed test 'command[test CPAN::Test::Dummy::Perl5::Build::Fails]' # at t/31sessions.t line 157. # 'Running test for module 'CPAN::Test::Dummy::Perl5::Build::Fails' # Running make for A/AN/ANDK/CPAN-Test-Dummy-Perl5-Build-Fails-1.03.tar.gz # Prepending /home/fw/Downloads/CPAN-1.88_68/t/dot-cpan/build/CPAN-Test-Dummy-Perl5-Make-1.05-UavELm/blib/arch /home/fw/Downloads/CPAN-1.88_68/t/dot-cpan/build/CPAN-Test-Dummy-Perl5-Make-1.05-UavELm/blib/lib to PERL5LIB for 'get' # CPAN: checksum security checks disabledbecause Digest::SHA not installed. # CPAN-Test-Dummy-Perl5-Build-Fails-1.03/ # CPAN-Test-Dummy-Perl5-Build-Fails-1.03/t/ # CPAN-Test-Dummy-Perl5-Build-Fails-1.03/t/00_load.t # CPAN-Test-Dummy-Perl5-Build-Fails-1.03/MANIFEST # CPAN-Test-Dummy-Perl5-Build-Fails-1.03/META.yml # CPAN-Test-Dummy-Perl5-Build-Fails-1.03/Changes # CPAN-Test-Dummy-Perl5-Build-Fails-1.03/lib/ # CPAN-Test-Dummy-Perl5-Build-Fails-1.03/lib/CPAN/ # CPAN-Test-Dummy-Perl5-Build-Fails-1.03/lib/CPAN/Test/ # CPAN-Test-Dummy-Perl5-Build-Fails-1.03/lib/CPAN/Test/Dummy/ # CPAN-Test-Dummy-Perl5-Build-Fails-1.03/lib/CPAN/Test/Dummy/Perl5/ # CPAN-Test-Dummy-Perl5-Build-Fails-1.03/lib/CPAN/Test/Dummy/Perl5/Build/ # CPAN-Test-Dummy-Perl5-Build-Fails-1.03/lib/CPAN/Test/Dummy/Perl5/Build/Fails.pm # CPAN-Test-Dummy-Perl5-Build-Fails-1.03/README # CPAN-Test-Dummy-Perl5-Build-Fails-1.03/Build.PL # Prepending /home/fw/Downloads/CPAN-1.88_68/t/dot-cpan/build/CPAN-Test-Dummy-Perl5-Make-1.05-UavELm/blib/arch /home/fw/Downloads/CPAN-1.88_68/t/dot-cpan/build/CPAN-Test-Dummy-Perl5-Make-1.05-UavELm/blib/lib to PERL5LIB for 'make' # # CPAN.pm: Going to build A/AN/ANDK/CPAN-Test-Dummy-Perl5-Build-Fails-1.03.tar.gz # # Checking whether your kit is complete... # Looks good # # Checking prerequisites... # Looks good # # Creating new 'Build' script for 'CPAN-Test-Dummy-Perl5-Build-Fails' version '1.03' # CPAN: Module::Build loaded ok (v0.2808) # Copying lib/CPAN/Test/Dummy/Perl5/Build/Fails.pm -> blib/lib/CPAN/Test/Dummy/Perl5/Build/Fails.pm # Manifying blib/lib/CPAN/Test/Dummy/Perl5/Build/Fails.pm -> blib/libdoc/CPAN::Test::Dummy::Perl5::Build::Fails.3pm # ANDK/CPAN-Test-Dummy-Perl5-Build-Fails-1.03.tar.gz # ./Build -- OK # Prepending /home/fw/Downloads/CPAN-1.88_68/t/dot-cpan/build/CPAN-Test-Dummy-Perl5-Make-1.05-UavELm/blib/arch /home/fw/Downloads/CPAN-1.88_68/t/dot-cpan/build/CPAN-Test-Dummy-Perl5-Make-1.05-UavELm/blib/lib to PERL5LIB for 'test' # Running Build test # t/00_load...... Failed 1/2 subtests # # Test Summary Report # ------------------- # t/00_load.t (Wstat: 0 Tests: 2 Failed: 1) # Failed test number(s): 2 # Files=1, Tests=2, 0 wallclock secs ( 0.01 usr + 0.00 sys = 0.01 CPU) # Result: FAIL # ANDK/CPAN-Test-Dummy-Perl5-Build-Fails-1.03.tar.gz # ./Build test -- NOT OK # Failed during this command: # ANDK/CPAN-Test-Dummy-Perl5-Build-Fails-1.03.tar.gz: make_test NO # # ' # doesn't match '/t/00_load....FAILED/' # Failed test 'command[test CPAN::Test::Dummy::Perl5::Build::Fails]' # at t/31sessions.t line 157. # 'Running test for module 'CPAN::Test::Dummy::Perl5::Build::Fails' # Running Build for A/AN/ANDK/CPAN-Test-Dummy-Perl5-Build-Fails-1.03.tar.gz # Prepending /home/fw/Downloads/CPAN-1.88_68/t/dot-cpan/build/CPAN-Test-Dummy-Perl5-Make-1.05-UavELm/blib/arch /home/fw/Downloads/CPAN-1.88_68/t/dot-cpan/build/CPAN-Test-Dummy-Perl5-Make-1.05-UavELm/blib/lib to PERL5LIB for 'get' # Has already been unwrapped into directory /home/fw/Downloads/CPAN-1.88_68/t/dot-cpan/build/CPAN-Test-Dummy-Perl5-Build-Fails-1.03-TeGrF7 # Prepending /home/fw/Downloads/CPAN-1.88_68/t/dot-cpan/build/CPAN-Test-Dummy-Perl5-Make-1.05-UavELm/blib/arch /home/fw/Downloads/CPAN-1.88_68/t/dot-cpan/build/CPAN-Test-Dummy-Perl5-Make-1.05-UavELm/blib/lib to PERL5LIB for 'make' # Has already been made # Prepending /home/fw/Downloads/CPAN-1.88_68/t/dot-cpan/build/CPAN-Test-Dummy-Perl5-Make-1.05-UavELm/blib/arch /home/fw/Downloads/CPAN-1.88_68/t/dot-cpan/build/CPAN-Test-Dummy-Perl5-Make-1.05-UavELm/blib/lib to PERL5LIB for 'test' # Running Build test # t/00_load...... Failed 1/2 subtests # # Test Summary Report # ------------------- # t/00_load.t (Wstat: 0 Tests: 2 Failed: 1) # Failed test number(s): 2 # Files=1, Tests=2, 0 wallclock secs ( 0.00 usr + 0.00 sys = 0.00 CPU) # Result: FAIL # ANDK/CPAN-Test-Dummy-Perl5-Build-Fails-1.03.tar.gz # ./Build test -- NOT OK # Failed during this command: # ANDK/CPAN-Test-Dummy-Perl5-Build-Fails-1.03.tar.gz: make_test NO # # ' # doesn't match '/t/00_load....FAILED/' # Failed test 'command[force get CPAN::Test::Dummy::Perl5::Build::Fails]' # at t/31sessions.t line 157. # 'Running get for module 'CPAN::Test::Dummy::Perl5::Build::Fails' # Prepending /home/fw/Downloads/CPAN-1.88_68/t/dot-cpan/build/CPAN-Test-Dummy-Perl5-Make-1.05-UavELm/blib/arch /home/fw/Downloads/CPAN-1.88_68/t/dot-cpan/build/CPAN-Test-Dummy-Perl5-Make-1.05-UavELm/blib/lib to PERL5LIB for 'get' # CPAN: checksum security checks disabledbecause Digest::SHA not installed. # CPAN-Test-Dummy-Perl5-Build-Fails-1.03/ # CPAN-Test-Dummy-Perl5-Build-Fails-1.03/t/ # CPAN-Test-Dummy-Perl5-Build-Fails-1.03/t/00_load.t # CPAN-Test-Dummy-Perl5-Build-Fails-1.03/MANIFEST # CPAN-Test-Dummy-Perl5-Build-Fails-1.03/META.yml # CPAN-Test-Dummy-Perl5-Build-Fails-1.03/Changes # CPAN-Test-Dummy-Perl5-Build-Fails-1.03/lib/ # CPAN-Test-Dummy-Perl5-Build-Fails-1.03/lib/CPAN/ # CPAN-Test-Dummy-Perl5-Build-Fails-1.03/lib/CPAN/Test/ # CPAN-Test-Dummy-Perl5-Build-Fails-1.03/lib/CPAN/Test/Dummy/ # CPAN-Test-Dummy-Perl5-Build-Fails-1.03/lib/CPAN/Test/Dummy/Perl5/ # CPAN-Test-Dummy-Perl5-Build-Fails-1.03/lib/CPAN/Test/Dummy/Perl5/Build/ # CPAN-Test-Dummy-Perl5-Build-Fails-1.03/lib/CPAN/Test/Dummy/Perl5/Build/Fails.pm # CPAN-Test-Dummy-Perl5-Build-Fails-1.03/README # CPAN-Test-Dummy-Perl5-Build-Fails-1.03/Build.PL # # ' # doesn't match '/Checksum for .*/CPAN-Test-Dummy-Perl5-Build-Fails-1.03.tar.gz ok/' # DEBUG: name[second]system["/usr/bin/perl" "-I/home/fw/Downloads/CPAN-1.88_68/t" "-Mblib" "-MCPAN::MyConfig" "-MCPAN" "-e" "@CPAN::Defaultsites = (); shell" > test.out] at t/31sessions.t line 142. The following failure is intentional in order to trigger the corresponding action of the installer program on distros with failing tests Failed 1/1 test programs. 1/2 subtests failed. # Failed test 'command[test CPAN::Test::Dummy::Perl5::Build::Fails]' # at t/31sessions.t line 157. # 'Running test for module 'CPAN::Test::Dummy::Perl5::Build::Fails' # Running Build for A/AN/ANDK/CPAN-Test-Dummy-Perl5-Build-Fails-1.03.tar.gz # Prepending /home/fw/Downloads/CPAN-1.88_68/t/dot-cpan/build/CPAN-Test-Dummy-Perl5-Make-1.05-UavELm/blib/arch /home/fw/Downloads/CPAN-1.88_68/t/dot-cpan/build/CPAN-Test-Dummy-Perl5-Make-1.05-UavELm/blib/lib to PERL5LIB for 'get' # Has already been unwrapped into directory /home/fw/Downloads/CPAN-1.88_68/t/dot-cpan/build/CPAN-Test-Dummy-Perl5-Build-Fails-1.03-TeGrF7 # Prepending /home/fw/Downloads/CPAN-1.88_68/t/dot-cpan/build/CPAN-Test-Dummy-Perl5-Make-1.05-UavELm/blib/arch /home/fw/Downloads/CPAN-1.88_68/t/dot-cpan/build/CPAN-Test-Dummy-Perl5-Make-1.05-UavELm/blib/lib to PERL5LIB for 'make' # Has already been made # Prepending /home/fw/Downloads/CPAN-1.88_68/t/dot-cpan/build/CPAN-Test-Dummy-Perl5-Make-1.05-UavELm/blib/arch /home/fw/Downloads/CPAN-1.88_68/t/dot-cpan/build/CPAN-Test-Dummy-Perl5-Make-1.05-UavELm/blib/lib to PERL5LIB for 'test' # Running Build test # t/00_load...... Failed 1/2 subtests # # Test Summary Report # ------------------- # t/00_load.t (Wstat: 0 Tests: 2 Failed: 1) # Failed test number(s): 2 # Files=1, Tests=2, 0 wallclock secs ( 0.00 usr + 0.00 sys = 0.00 CPU) # Result: FAIL # ANDK/CPAN-Test-Dummy-Perl5-Build-Fails-1.03.tar.gz # ./Build test -- NOT OK # Failed during this command: # ANDK/CPAN-Test-Dummy-Perl5-Build-Fails-1.03.tar.gz: make_test NO # # ' # doesn't match '/t/00_load....FAILED/' # DEBUG: name[without_yaml]system["/usr/bin/perl" "-I/home/fw/Downloads/CPAN-1.88_68/t" "-Mblib" "-MCPAN::MyConfig" "-MCPAN" "-e" "@CPAN::Defaultsites = (); shell" > test.out] at t/31sessions.t line 142. t/31sessions......25/? # Failed test 'command[get CPAN::Test::Dummy::Perl5::Make]' # at t/31sessions.t line 157. # 'CPAN: Storable loaded ok (v2.18) # Going to read /home/fw/Downloads/CPAN-1.88_68/t/dot-cpan/Metadata # Warning: Found only 31 objects in /home/fw/Downloads/CPAN-1.88_68/t/dot-cpan/Metadata # CPAN: LWP::UserAgent loaded ok (v2.033) # CPAN: Time::HiRes loaded ok (v1.9711) # CPAN: URI::URL loaded ok (v5.03) # Going to read /home/fw/Downloads/CPAN-1.88_68/t/CPAN/authors/01mailrc.txt # CPAN: Compress::Zlib loaded ok (v2.008) # ............................................................................DONE # Going to read /home/fw/Downloads/CPAN-1.88_68/t/CPAN/modules/02packages.details.txt # Database was generated on Tue, 03 Feb 1970 03:17:06 GMT # Warning: This index file is 13834 days old. # Please check the host you chose as your CPAN mirror for staleness. # I'll continue but problems seem likely to happen. # ............................................................................DONE # Going to read /home/fw/Downloads/CPAN-1.88_68/t/CPAN/modules/03modlist.data # ............................................................................DONE # Going to write /home/fw/Downloads/CPAN-1.88_68/t/dot-cpan/Metadata # Running get for module 'CPAN::Test::Dummy::Perl5::Make' # # CPAN: checksum security checks disabled because Digest::SHA not installed. # Please consider installing the Digest::SHA module. # # Scanning cache /home/fw/Downloads/CPAN-1.88_68/t/dot-cpan/build for sizes # ............................................................................DONE # CPAN: Archive::Tar loaded ok (v1.36) # CPAN-Test-Dummy-Perl5-Make-1.05/ # CPAN-Test-Dummy-Perl5-Make-1.05/t/ # CPAN-Test-Dummy-Perl5-Make-1.05/t/00_load.t # CPAN-Test-Dummy-Perl5-Make-1.05/MANIFEST # CPAN-Test-Dummy-Perl5-Make-1.05/lib/ # CPAN-Test-Dummy-Perl5-Make-1.05/lib/Bundle/ # CPAN-Test-Dummy-Perl5-Make-1.05/lib/Bundle/CpanTestDummies.pm # CPAN-Test-Dummy-Perl5-Make-1.05/lib/CPAN/ # CPAN-Test-Dummy-Perl5-Make-1.05/lib/CPAN/Test/ # CPAN-Test-Dummy-Perl5-Make-1.05/lib/CPAN/Test/Dummy/ # CPAN-Test-Dummy-Perl5-Make-1.05/lib/CPAN/Test/Dummy/Perl5/ # CPAN-Test-Dummy-Perl5-Make-1.05/lib/CPAN/Test/Dummy/Perl5/Make.pm # CPAN-Test-Dummy-Perl5-Make-1.05/Changes # CPAN-Test-Dummy-Perl5-Make-1.05/README # CPAN-Test-Dummy-Perl5-Make-1.05/Makefile.PL # CPAN-Test-Dummy-Perl5-Make-1.05/META.yml # CPAN: File::Temp loaded ok (v0.19) # Warning (usually harmless): 'YAML' not installed, will not store persistent state # # ' # doesn't match '/(?sx:cannot.parse.*?FTPstats.* # CPAN-Test-Dummy-Perl5-Make-1.\d+/lib/CPAN/Test/Dummy/Perl5/Make.pm.* # will.not.store.persistent.state)/' # DEBUG: name[focussing test]system["/usr/bin/perl" "-I/home/fw/Downloads/CPAN-1.88_68/t" "-Mblib" "-MCPAN::MyConfig" "-MCPAN" "-e" "@CPAN::Defaultsites = (); shell" > test.out] at t/31sessions.t line 142. Warning: prerequisite CPAN::Test::Dummy::Perl5::Make::CircDepeThree 0 not found. Warning: prerequisite CPAN::Test::Dummy::Perl5::Make::CircDepeTwo 0 not found. Warning: prerequisite CPAN::Test::Dummy::Perl5::Make::CircDepeOne 0 not found. t/31sessions......28/? # Failed test 'command[test CPAN::Test::Dummy::Perl5::Make::CircDepeOne]' # at t/31sessions.t line 157. # 'Running test for module 'CPAN::Test::Dummy::Perl5::Make::CircDepeOne' # Running make for A/AN/ANDK/CPAN-Test-Dummy-Perl5-Make-CircDepeOne-1.00.tar.gz # # CPAN: checksum security checks disabled because Digest::SHA not installed. # Please consider installing the Digest::SHA module. # # Scanning cache /home/fw/Downloads/CPAN-1.88_68/t/dot-cpan/build for sizes # ............................................................................DONE # CPAN: Archive::Tar loaded ok (v1.36) # CPAN-Test-Dummy-Perl5-Make-CircDepeOne-1.00/ # CPAN-Test-Dummy-Perl5-Make-CircDepeOne-1.00/t/ # CPAN-Test-Dummy-Perl5-Make-CircDepeOne-1.00/t/00_load.t # CPAN-Test-Dummy-Perl5-Make-CircDepeOne-1.00/MANIFEST # CPAN-Test-Dummy-Perl5-Make-CircDepeOne-1.00/lib/ # CPAN-Test-Dummy-Perl5-Make-CircDepeOne-1.00/lib/CPAN/ # CPAN-Test-Dummy-Perl5-Make-CircDepeOne-1.00/lib/CPAN/Test/ # CPAN-Test-Dummy-Perl5-Make-CircDepeOne-1.00/lib/CPAN/Test/Dummy/ # CPAN-Test-Dummy-Perl5-Make-CircDepeOne-1.00/lib/CPAN/Test/Dummy/Perl5/ # CPAN-Test-Dummy-Perl5-Make-CircDepeOne-1.00/lib/CPAN/Test/Dummy/Perl5/Make/ # CPAN-Test-Dummy-Perl5-Make-CircDepeOne-1.00/lib/CPAN/Test/Dummy/Perl5/Make/CircDepeOne.pm # CPAN-Test-Dummy-Perl5-Make-CircDepeOne-1.00/Changes # CPAN-Test-Dummy-Perl5-Make-CircDepeOne-1.00/README # CPAN-Test-Dummy-Perl5-Make-CircDepeOne-1.00/Makefile.PL # CPAN-Test-Dummy-Perl5-Make-CircDepeOne-1.00/META.yml # CPAN: File::Temp loaded ok (v0.19) # Warning (usually harmless): 'YAML' not installed, will not store persistent state # # CPAN.pm: Going to build A/AN/ANDK/CPAN-Test-Dummy-Perl5-Make-CircDepeOne-1.00.tar.gz # # Checking if your kit is complete... # Looks good # Writing Makefile for CPAN::Test::Dummy::Perl5::Make::CircDepeOne # Could not read '/home/fw/Downloads/CPAN-1.88_68/t/dot-cpan/build/CPAN-Test-Dummy-Perl5-Make-CircDepeOne-1.00-NEdIAu/META.yml'. Falling back to other methods to determine prerequisites # ---- Unsatisfied dependencies detected during ---- # ---- ANDK/CPAN-Test-Dummy-Perl5-Make-CircDepeOne-1.00.tar.gz ---- # CPAN::Test::Dummy::Perl5::Make::CircDepeThree [requires] # Running make test # Delayed until after prerequisites # Running test for module 'CPAN::Test::Dummy::Perl5::Make::CircDepeThree' # Running make for A/AN/ANDK/CPAN-Test-Dummy-Perl5-Make-CircDepeThree-1.00.tar.gz # CPAN: checksum security checks disabledbecause Digest::SHA not installed. # CPAN-Test-Dummy-Perl5-Make-CircDepeThree-1.00/ # CPAN-Test-Dummy-Perl5-Make-CircDepeThree-1.00/t/ # CPAN-Test-Dummy-Perl5-Make-CircDepeThree-1.00/t/00_load.t # CPAN-Test-Dummy-Perl5-Make-CircDepeThree-1.00/MANIFEST # CPAN-Test-Dummy-Perl5-Make-CircDepeThree-1.00/Changes # CPAN-Test-Dummy-Perl5-Make-CircDepeThree-1.00/README # CPAN-Test-Dummy-Perl5-Make-CircDepeThree-1.00/Makefile.PL # CPAN-Test-Dummy-Perl5-Make-CircDepeThree-1.00/lib/ # CPAN-Test-Dummy-Perl5-Make-CircDepeThree-1.00/lib/CPAN/ # CPAN-Test-Dummy-Perl5-Make-CircDepeThree-1.00/lib/CPAN/Test/ # CPAN-Test-Dummy-Perl5-Make-CircDepeThree-1.00/lib/CPAN/Test/Dummy/ # CPAN-Test-Dummy-Perl5-Make-CircDepeThree-1.00/lib/CPAN/Test/Dummy/Perl5/ # CPAN-Test-Dummy-Perl5-Make-CircDepeThree-1.00/lib/CPAN/Test/Dummy/Perl5/Make/ # CPAN-Test-Dummy-Perl5-Make-CircDepeThree-1.00/lib/CPAN/Test/Dummy/Perl5/Make/CircDepeThree.pm # CPAN-Test-Dummy-Perl5-Make-CircDepeThree-1.00/META.yml # Warning (usually harmless): 'YAML' not installed, will not store persistent state # # CPAN.pm: Going to build A/AN/ANDK/CPAN-Test-Dummy-Perl5-Make-CircDepeThree-1.00.tar.gz # # Checking if your kit is complete... # Looks good # Writing Makefile for CPAN::Test::Dummy::Perl5::Make::CircDepeThree # Could not read '/home/fw/Downloads/CPAN-1.88_68/t/dot-cpan/build/CPAN-Test-Dummy-Perl5-Make-CircDepeThree-1.00-EAm01F/META.yml'. Falling back to other methods to determine prerequisites # ---- Unsatisfied dependencies detected during ---- # ---- ANDK/CPAN-Test-Dummy-Perl5-Make-CircDepeThree-1.00.tar.gz ---- # CPAN::Test::Dummy::Perl5::Make::CircDepeTwo [requires] # Running make test # Delayed until after prerequisites # Running test for module 'CPAN::Test::Dummy::Perl5::Make::CircDepeTwo' # Running make for A/AN/ANDK/CPAN-Test-Dummy-Perl5-Make-CircDepeTwo-1.00.tar.gz # CPAN: checksum security checks disabledbecause Digest::SHA not installed. # CPAN-Test-Dummy-Perl5-Make-CircDepeTwo-1.00/ # CPAN-Test-Dummy-Perl5-Make-CircDepeTwo-1.00/t/ # CPAN-Test-Dummy-Perl5-Make-CircDepeTwo-1.00/t/00_load.t # CPAN-Test-Dummy-Perl5-Make-CircDepeTwo-1.00/MANIFEST # CPAN-Test-Dummy-Perl5-Make-CircDepeTwo-1.00/lib/ # CPAN-Test-Dummy-Perl5-Make-CircDepeTwo-1.00/lib/CPAN/ # CPAN-Test-Dummy-Perl5-Make-CircDepeTwo-1.00/lib/CPAN/Test/ # CPAN-Test-Dummy-Perl5-Make-CircDepeTwo-1.00/lib/CPAN/Test/Dummy/ # CPAN-Test-Dummy-Perl5-Make-CircDepeTwo-1.00/lib/CPAN/Test/Dummy/Perl5/ # CPAN-Test-Dummy-Perl5-Make-CircDepeTwo-1.00/lib/CPAN/Test/Dummy/Perl5/Make/ # CPAN-Test-Dummy-Perl5-Make-CircDepeTwo-1.00/lib/CPAN/Test/Dummy/Perl5/Make/CircDepeTwo.pm # CPAN-Test-Dummy-Perl5-Make-CircDepeTwo-1.00/Changes # CPAN-Test-Dummy-Perl5-Make-CircDepeTwo-1.00/README # CPAN-Test-Dummy-Perl5-Make-CircDepeTwo-1.00/Makefile.PL # CPAN-Test-Dummy-Perl5-Make-CircDepeTwo-1.00/META.yml # Warning (usually harmless): 'YAML' not installed, will not store persistent state # # CPAN.pm: Going to build A/AN/ANDK/CPAN-Test-Dummy-Perl5-Make-CircDepeTwo-1.00.tar.gz # # Checking if your kit is complete... # Looks good # Writing Makefile for CPAN::Test::Dummy::Perl5::Make::CircDepeTwo # Could not read '/home/fw/Downloads/CPAN-1.88_68/t/dot-cpan/build/CPAN-Test-Dummy-Perl5-Make-CircDepeTwo-1.00-b2aeKF/META.yml'. Falling back to other methods to determine prerequisites # ---- Unsatisfied dependencies detected during ---- # ---- ANDK/CPAN-Test-Dummy-Perl5-Make-CircDepeTwo-1.00.tar.gz ---- # CPAN::Test::Dummy::Perl5::Make::CircDepeOne [requires] # Running make test # Delayed until after prerequisites # Running test for module 'CPAN::Test::Dummy::Perl5::Make::CircDepeOne' # Running make for A/AN/ANDK/CPAN-Test-Dummy-Perl5-Make-CircDepeOne-1.00.tar.gz # Has already been unwrapped into directory /home/fw/Downloads/CPAN-1.88_68/t/dot-cpan/build/CPAN-Test-Dummy-Perl5-Make-CircDepeOne-1.00-NEdIAu # # CPAN.pm: Going to build A/AN/ANDK/CPAN-Test-Dummy-Perl5-Make-CircDepeOne-1.00.tar.gz # # cp lib/CPAN/Test/Dummy/Perl5/Make/CircDepeOne.pm blib/lib/CPAN/Test/Dummy/Perl5/Make/CircDepeOne.pm # Manifying blib/man3/CPAN::Test::Dummy::Perl5::Make::CircDepeOne.3pm # ANDK/CPAN-Test-Dummy-Perl5-Make-CircDepeOne-1.00.tar.gz # make -- OK # Warning (usually harmless): 'YAML' not installed, will not store persistent state # Running make test # PERL_DL_NONLAZY=1 /usr/bin/perl "-MExtUtils::Command::MM" "-e" "test_harness(0, 'blib/lib', 'blib/arch')" t/*.t # t/00_load......ok # All tests successful. # Files=1, Tests=2, 0 wallclock secs ( 0.01 usr 0.00 sys + 0.01 cusr 0.00 csys = 0.02 CPU) # Result: PASS # ANDK/CPAN-Test-Dummy-Perl5-Make-CircDepeOne-1.00.tar.gz # Tests succeeded but one dependency not OK (CPAN::Test::Dummy::Perl5::Make::CircDepeThree) # Warning (usually harmless): 'YAML' not installed, will not store persistent state # Running make for A/AN/ANDK/CPAN-Test-Dummy-Perl5-Make-CircDepeTwo-1.00.tar.gz # Has already been unwrapped into directory /home/fw/Downloads/CPAN-1.88_68/t/dot-cpan/build/CPAN-Test-Dummy-Perl5-Make-CircDepeTwo-1.00-b2aeKF # # CPAN.pm: Going to build A/AN/ANDK/CPAN-Test-Dummy-Perl5-Make-CircDepeTwo-1.00.tar.gz # # cp lib/CPAN/Test/Dummy/Perl5/Make/CircDepeTwo.pm blib/lib/CPAN/Test/Dummy/Perl5/Make/CircDepeTwo.pm # Manifying blib/man3/CPAN::Test::Dummy::Perl5::Make::CircDepeTwo.3pm # ANDK/CPAN-Test-Dummy-Perl5-Make-CircDepeTwo-1.00.tar.gz # make -- OK # Warning (usually harmless): 'YAML' not installed, will not store persistent state # Running make test # PERL_DL_NONLAZY=1 /usr/bin/perl "-MExtUtils::Command::MM" "-e" "test_harness(0, 'blib/lib', 'blib/arch')" t/*.t # t/00_load......ok # All tests successful. # Files=1, Tests=2, 0 wallclock secs ( 0.00 usr + 0.00 sys = 0.00 CPU) # Result: PASS # ANDK/CPAN-Test-Dummy-Perl5-Make-CircDepeTwo-1.00.tar.gz # Tests succeeded but one dependency not OK (CPAN::Test::Dummy::Perl5::Make::CircDepeOne) # Warning (usually harmless): 'YAML' not installed, will not store persistent state # Running make for A/AN/ANDK/CPAN-Test-Dummy-Perl5-Make-CircDepeThree-1.00.tar.gz # Has already been unwrapped into directory /home/fw/Downloads/CPAN-1.88_68/t/dot-cpan/build/CPAN-Test-Dummy-Perl5-Make-CircDepeThree-1.00-EAm01F # # CPAN.pm: Going to build A/AN/ANDK/CPAN-Test-Dummy-Perl5-Make-CircDepeThree-1.00.tar.gz # # cp lib/CPAN/Test/Dummy/Perl5/Make/CircDepeThree.pm blib/lib/CPAN/Test/Dummy/Perl5/Make/CircDepeThree.pm # Manifying blib/man3/CPAN::Test::Dummy::Perl5::Make::CircDepeThree.3pm # ANDK/CPAN-Test-Dummy-Perl5-Make-CircDepeThree-1.00.tar.gz # make -- OK # Warning (usually harmless): 'YAML' not installed, will not store persistent state # Running make test # PERL_DL_NONLAZY=1 /usr/bin/perl "-MExtUtils::Command::MM" "-e" "test_harness(0, 'blib/lib', 'blib/arch')" t/*.t # t/00_load......ok # All tests successful. # Files=1, Tests=2, 0 wallclock secs ( 0.00 usr + 0.00 sys = 0.00 CPU) # Result: PASS # ANDK/CPAN-Test-Dummy-Perl5-Make-CircDepeThree-1.00.tar.gz # Tests succeeded but one dependency not OK (CPAN::Test::Dummy::Perl5::Make::CircDepeTwo) # Warning (usually harmless): 'YAML' not installed, will not store persistent state # Running make for A/AN/ANDK/CPAN-Test-Dummy-Perl5-Make-CircDepeOne-1.00.tar.gz # Has already been unwrapped into directory /home/fw/Downloads/CPAN-1.88_68/t/dot-cpan/build/CPAN-Test-Dummy-Perl5-Make-CircDepeOne-1.00-NEdIAu # Has already been made # Running make test # PERL_DL_NONLAZY=1 /usr/bin/perl "-MExtUtils::Command::MM" "-e" "test_harness(0, 'blib/lib', 'blib/arch')" t/*.t # t/00_load......ok # All tests successful. # Files=1, Tests=2, 0 wallclock secs ( 0.01 usr 0.00 sys + 0.01 cusr 0.00 csys = 0.02 CPU) # Result: PASS # ANDK/CPAN-Test-Dummy-Perl5-Make-CircDepeOne-1.00.tar.gz # Tests succeeded but one dependency not OK (CPAN::Test::Dummy::Perl5::Make::CircDepeThree) # Warning (usually harmless): 'YAML' not installed, will not store persistent state # # Recursive dependency detected: # CPAN::Test::Dummy::Perl5::Make::CircDepeOne # => A/AN/ANDK/CPAN-Test-Dummy-Perl5-Make-CircDepeOne-1.00.tar.gz # => CPAN::Test::Dummy::Perl5::Make::CircDepeThree # => A/AN/ANDK/CPAN-Test-Dummy-Perl5-Make-CircDepeThree-1.00.tar.gz # => CPAN::Test::Dummy::Perl5::Make::CircDepeTwo # => A/AN/ANDK/CPAN-Test-Dummy-Perl5-Make-CircDepeTwo-1.00.tar.gz # => CPAN::Test::Dummy::Perl5::Make::CircDepeOne. # Cannot continue. # Failed during this command: # ANDK/CPAN-Test-Dummy-Perl5-Make-CircDepeTwo-1.00.tar.gz: make_test NO one dependency not OK (CPAN::Test::Dummy::Perl5::Make::CircDepeOne) # ANDK/CPAN-Test-Dummy-Perl5-Make-CircDepeThree-1.00.tar.gz: make_test NO one dependency not OK (CPAN::Test::Dummy::Perl5::Make::CircDepeTwo) # ANDK/CPAN-Test-Dummy-Perl5-Make-CircDepeOne-1.00.tar.gz: make_test NO one dependency not OK (CPAN::Test::Dummy::Perl5::Make::CircDepeThree) # # ' # doesn't match '/(?xs: # Running.test.for.module.+CPAN::Test::Dummy::Perl5::Make::CircDepeOne.+ # CPAN::Test::Dummy::Perl5::Make::CircDepeThree.+\[requires\].+ # CPAN::Test::Dummy::Perl5::Make::CircDepeTwo.+\[requires\].+ # CPAN::Test::Dummy::Perl5::Make::CircDepeOne.+\[requires\].+ # t/00_load\.\.\.\.ok.+ # succeeded.but.one.dependency.not.OK.+ # Recursive.dependency.detected # )/' # Looks like you failed 6 tests of 29. t/31sessions...... Dubious, test returned 6 (wstat 1536, 0x600) Failed 6/29 subtests Test Summary Report ------------------- t/31sessions.t (Wstat: 1536 Tests: 29 Failed: 6) Failed test number(s): 9-10, 13, 21, 25, 29 Non-zero exit status: 6 Files=1, Tests=29, 13 wallclock secs ( 0.01 usr 0.00 sys + 3.80 cusr 0.82 csys = 4.63 CPU) Result: FAIL
Thanks, Frank and Ken for the detailed protocols. I could quite quickly reproduce the case by hiding Compress::Zlib and so I fixed it in my copy. Will make a release soon.
I manually upgraded Compress::Zlib to version 2.008, and I still get the errors in t/31sessions.t . Would you have expected them to go away? -Ken
Subject: Re: [rt.cpan.org #31750] t/31sessions.t fails on 1.9205 and 1.92_53
Date: Thu, 27 Dec 2007 06:07:02 +0100
To: bug-CPAN@rt.cpan.org
From: andreas.koenig.7os6VVqR@franz.ak.mind.de (Andreas J. Koenig)
Show quoted text
>>>>> On Wed, 26 Dec 2007 17:31:49 -0500, "Ken Williams via RT" <bug-CPAN@rt.cpan.org> said:
Show quoted text
> Queue: CPAN > Ticket <URL: http://rt.cpan.org/Ticket/Display.html?id=31750 >
Show quoted text
> I manually upgraded Compress::Zlib to version 2.008, and I still > get the errors in t/31sessions.t . Would you have expected them to > go away?
Thank you, Ken, more or less, yes. Sounds like a call for a dev release. Please try 1.92_54, uploaded a few minutes ago. -- andreas
From: frank.wiegand@gmail.com
On Do. 27. Dez. 2007, 01:34:27, andreas.koenig.7os6VVqR@franz.ak.mind.de wrote:
Show quoted text
> Please try 1.92_54, uploaded a few minutes ago.
Runs fine for me: fw@cu-pontos:~/Downloads/CPAN-1.92_54$ make test PERL_DL_NONLAZY=1 /usr/bin/perl "-MExtUtils::Command::MM" "-e" "test_harness(0, 'blib/lib', 'blib/arch')" t/*.t t/00signature.........ok t/01loadme............ok t/02nox...............ok t/03pkgs..............ok t/10version...........ok t/11mirroredby........ok t/12cpan..............ok t/13tarzip............ok t/30shell.............skipped: no Expect, maybe try env CPAN_RUN_SHELL_TEST_WITHOUT_EXPECT=1 t/31sessions..........2/? The following failure is intentional in order to trigger the corresponding action of the installer program on distros with failing tests Failed 1/1 test programs. 1/2 subtests failed. The following failure is intentional in order to trigger the corresponding action of the installer program on distros with failing tests Failed 1/1 test programs. 1/2 subtests failed. t/31sessions..........5/? The following failure is intentional in order to trigger the corresponding action of the installer program on distros with failing tests Failed 1/1 test programs. 1/2 subtests failed. t/31sessions..........31/? Warning: prerequisite CPAN::Test::Dummy::Perl5::Make::CircDepeThree 0 not found. Warning: prerequisite CPAN::Test::Dummy::Perl5::Make::CircDepeTwo 0 not found. Warning: prerequisite CPAN::Test::Dummy::Perl5::Make::CircDepeOne 0 not found. t/31sessions..........35/? Warning: prerequisite CPAN::Test::Dummy::Perl5::Make 99999999.99 not found. t/31sessions..........ok t/41distribution......ok t/50pod...............ok t/51pod...............ok t/52podcover..........ok t/60credentials.......ok All tests successful. Files=15, Tests=245, 24 wallclock secs ( 0.05 usr 0.02 sys + 7.30 cusr 1.01 csys = 8.38 CPU) Result: PASS Thanks, Frank
On Thu Dec 27 01:34:27 2007, andreas.koenig.7os6VVqR@franz.ak.mind.de wrote:
Show quoted text
> Sounds like a call for a dev release. Please try > 1.92_54, uploaded a few minutes ago.
It's an improvement, but I still get one failure: t/31sessions..........2/? The following failure is intentional in order to trigger the corresponding action of the installer program on distros with failing tests Failed 1/1 test programs. 1/2 subtests failed. The following failure is intentional in order to trigger the corresponding action of the installer program on distros with failing tests Failed 1/1 test programs. 1/2 subtests failed. t/31sessions..........5/? Can't exec "./Build": No such file or directory at /home/ken/downloads/perl/CPAN-1.92_54/blib/lib/CPAN.pm line 8704. t/31sessions..........22/? # Failed test (t/31sessions.t at line 227) # 'Running test for module 'CPAN::Test::Dummy::Perl5::Build::Fails' # Running Build for A/AN/ANDK/CPAN-Test-Dummy-Perl5-Build-Fails-1.03.tar.gz # Prepending /home/ken/downloads/perl/CPAN-1.92_54/t/dot-cpan/build/CPAN-Test- Dummy-Perl5-Make-1.05/blib/arch /home/ken/downloads/perl/CPAN-1.92_54/t/dot- cpan/build/CPAN-Test-Dummy-Perl5-Make-1.05/blib/lib to PERL5LIB for 'get' # Has already been unwrapped into directory /home/ken/downloads/perl/CPAN- 1.92_54/t/dot-cpan/build/CPAN-Test-Dummy-Perl5-Build-Fails-1.03 # Prepending /home/ken/downloads/perl/CPAN-1.92_54/t/dot-cpan/build/CPAN-Test- Dummy-Perl5-Make-1.05/blib/arch /home/ken/downloads/perl/CPAN-1.92_54/t/dot- cpan/build/CPAN-Test-Dummy-Perl5-Make-1.05/blib/lib to PERL5LIB for 'make' # Has already been made # Prepending /home/ken/downloads/perl/CPAN-1.92_54/t/dot-cpan/build/CPAN-Test- Dummy-Perl5-Make-1.05/blib/arch /home/ken/downloads/perl/CPAN-1.92_54/t/dot- cpan/build/CPAN-Test-Dummy-Perl5-Make-1.05/blib/lib to PERL5LIB for 'test' # Running Build test # ANDK/CPAN-Test-Dummy-Perl5-Build-Fails-1.03.tar.gz # ./Build test -- NOT OK # //hint// to see the cpan-testers results for installing this module, try: # reports ANDK/CPAN-Test-Dummy-Perl5-Build-Fails-1.03.tar.gz # Failed during this command: # ANDK/CPAN-Test-Dummy-Perl5-Build-Fails-1.03.tar.gz: make_test NO # ' # doesn't match '/(?i:t/00_load.+FAILED)/' # ['']["CPAN: Storable loaded ok (v2.15)\cJGoing to read /home/ken/downloads/perl/CPAN- 1.92_54/t/dot-cpan/Metadata\cJWarning: Found only 35 objects in /home/ken/downloads/perl/CPAN-1.92_54/t/dot-cpan/Metadata\cJCPAN: LWP::UserAgent loaded ok (v2.033)\cJCPAN: Time::HiRes loaded ok (v1.9711)\cJCPAN: URI::URL loaded ok (v5.03)\cJCPAN: YAML loaded ok (v0.66)\cJGoing to read /home/ken/downloads/perl/CPAN- 1.92_54/t/CPAN/authors/01mailrc.txt\cJCPAN: Compress::Zlib loaded ok (v2.008)\cJGoing to read /home/ken/downloads/perl/CPAN-1.92_54/t/dot- cpan/build/\cJ............................................................................DONE\cJFound 3 old builds, restored the state of 3\cJ............................................................................DONE\cJGoing to read /home/ken/downloads/perl/CPAN- 1.92_54/t/CPAN/modules/02packages.details.txt\cJ Database was generated on Tue, 03 Feb 1970 03:17:06 GMT\cJWarning: This index file is 13841 days old.\cJ Please check the host you chose as your CPAN mirror for staleness.\cJ I'll continue but problems seem likely to happen.\cG\cJ............................................................................DONE\cJGoing to read /home/ken/downloads/perl/CPAN- 1.92_54/t/CPAN/modules/03modlist.data\cJ.......................................................................... ..DONE\cJGoing to write /home/ken/downloads/perl/CPAN-1.92_54/t/dot- cpan/Metadata\cJRunning get for module 'CPAN::Test::Dummy::Perl5::Make'\cJPrepending /home/ken/downloads/perl/CPAN-1.92_54/t/dot-cpan/build/CPAN-Test-Dummy-Perl5- Make-1.05/blib/arch /home/ken/downloads/perl/CPAN-1.92_54/t/dot-cpan/build/CPAN- Test-Dummy-Perl5-Make-1.05/blib/lib to PERL5LIB for 'get'\cJ Has already been unwrapped into directory /home/ken/downloads/perl/CPAN-1.92_54/t/dot- cpan/build/CPAN-Test-Dummy-Perl5-Make-1.05\cJ"]['Running make for module \'CPAN::Test::Dummy::Perl5::Make\' Running make for A/AN/ANDK/CPAN-Test-Dummy-Perl5-Make-1.05.tar.gz Prepending /home/ken/downloads/perl/CPAN-1.92_54/t/dot-cpan/build/CPAN-Test- Dummy-Perl5-Make-1.05/blib/arch /home/ken/downloads/perl/CPAN-1.92_54/t/dot- cpan/build/CPAN-Test-Dummy-Perl5-Make-1.05/blib/lib to PERL5LIB for \'get\' Has already been unwrapped into directory /home/ken/downloads/perl/CPAN- 1.92_54/t/dot-cpan/build/CPAN-Test-Dummy-Perl5-Make-1.05 Prepending /home/ken/downloads/perl/CPAN-1.92_54/t/dot-cpan/build/CPAN-Test- Dummy-Perl5-Make-1.05/blib/arch /home/ken/downloads/perl/CPAN-1.92_54/t/dot- cpan/build/CPAN-Test-Dummy-Perl5-Make-1.05/blib/lib to PERL5LIB for \'make\' Has already been made ']['Running test for module \'CPAN::Test::Dummy::Perl5::Make\' Running make for A/AN/ANDK/CPAN-Test-Dummy-Perl5-Make-1.05.tar.gz Prepending /home/ken/downloads/perl/CPAN-1.92_54/t/dot-cpan/build/CPAN-Test- Dummy-Perl5-Make-1.05/blib/arch /home/ken/downloads/perl/CPAN-1.92_54/t/dot- cpan/build/CPAN-Test-Dummy-Perl5-Make-1.05/blib/lib to PERL5LIB for \'get\' Has already been unwrapped into directory /home/ken/downloads/perl/CPAN- 1.92_54/t/dot-cpan/build/CPAN-Test-Dummy-Perl5-Make-1.05 Prepending /home/ken/downloads/perl/CPAN-1.92_54/t/dot-cpan/build/CPAN-Test- Dummy-Perl5-Make-1.05/blib/arch /home/ken/downloads/perl/CPAN-1.92_54/t/dot- cpan/build/CPAN-Test-Dummy-Perl5-Make-1.05/blib/lib to PERL5LIB for \'make\' Has already been made Prepending /home/ken/downloads/perl/CPAN-1.92_54/t/dot-cpan/build/CPAN-Test- Dummy-Perl5-Make-1.05/blib/arch /home/ken/downloads/perl/CPAN-1.92_54/t/dot- cpan/build/CPAN-Test-Dummy-Perl5-Make-1.05/blib/lib to PERL5LIB for \'test\' Running make test Has already been tested successfully ']['Running get for module \'CPAN::Test::Dummy::Perl5::Build::Fails\' Prepending /home/ken/downloads/perl/CPAN-1.92_54/t/dot-cpan/build/CPAN-Test- Dummy-Perl5-Make-1.05/blib/arch /home/ken/downloads/perl/CPAN-1.92_54/t/dot- cpan/build/CPAN-Test-Dummy-Perl5-Make-1.05/blib/lib to PERL5LIB for \'get\' Has already been unwrapped into directory /home/ken/downloads/perl/CPAN- 1.92_54/t/dot-cpan/build/CPAN-Test-Dummy-Perl5-Build-Fails-1.03 ']['Running make for module \'CPAN::Test::Dummy::Perl5::Build::Fails\' Running Build for A/AN/ANDK/CPAN-Test-Dummy-Perl5-Build-Fails-1.03.tar.gz Prepending /home/ken/downloads/perl/CPAN-1.92_54/t/dot-cpan/build/CPAN-Test- Dummy-Perl5-Make-1.05/blib/arch /home/ken/downloads/perl/CPAN-1.92_54/t/dot- cpan/build/CPAN-Test-Dummy-Perl5-Make-1.05/blib/lib to PERL5LIB for \'get\' Has already been unwrapped into directory /home/ken/downloads/perl/CPAN- 1.92_54/t/dot-cpan/build/CPAN-Test-Dummy-Perl5-Build-Fails-1.03 Prepending /home/ken/downloads/perl/CPAN-1.92_54/t/dot-cpan/build/CPAN-Test- Dummy-Perl5-Make-1.05/blib/arch /home/ken/downloads/perl/CPAN-1.92_54/t/dot- cpan/build/CPAN-Test-Dummy-Perl5-Make-1.05/blib/lib to PERL5LIB for \'make\' Has already been made '] at t/31sessions.t line 231. t/31sessions..........31/? Warning: prerequisite CPAN::Test::Dummy::Perl5::Make::CircDepeThree 0 not found. Warning: prerequisite CPAN::Test::Dummy::Perl5::Make::CircDepeTwo 0 not found. Warning: prerequisite CPAN::Test::Dummy::Perl5::Make::CircDepeOne 0 not found. t/31sessions..........35/? Warning: prerequisite CPAN::Test::Dummy::Perl5::Make 99999999.99 not found. t/31sessions..........37/? # Looks like you failed 1 tests of 38. t/31sessions.......... Dubious, test returned 1 (wstat 256, 0x100) Failed 1/38 subtests t/41distribution......ok t/50pod...............skipped: Test::Pod 1.00 required for testing POD t/51pod...............ok t/52podcover..........skipped: Test::Pod::Coverage 0.18 required for testing pod coverage t/60credentials.......ok Test Summary Report ------------------- t/31sessions.t (Wstat: 256 Tests: 38 Failed: 1) Failed test number(s): 27 Non-zero exit status: 1 Files=15, Tests=470, 98 wallclock secs ( 1.08 usr 0.06 sys + 55.93 cusr 11.55 csys = 68.62 CPU) Result: FAIL Failed 1/15 test programs. 1/470 subtests failed. make: *** [test_dynamic] Error 255
Subject: Re: [rt.cpan.org #31750] t/31sessions.t fails on 1.9205 and 1.92_53
Date: Sun, 30 Dec 2007 17:44:26 +0100
To: bug-CPAN@rt.cpan.org
From: andreas.koenig.7os6VVqR@franz.ak.mind.de (Andreas J. Koenig)
Show quoted text
>>>>> On Thu, 27 Dec 2007 12:42:32 -0500, "Ken Williams via RT" <bug-CPAN@rt.cpan.org> said:
Show quoted text
> Queue: CPAN > Ticket <URL: http://rt.cpan.org/Ticket/Display.html?id=31750 >
Show quoted text
> On Thu Dec 27 01:34:27 2007, andreas.koenig.7os6VVqR@franz.ak.mind.de wrote:
>> Sounds like a call for a dev release. Please try >> 1.92_54, uploaded a few minutes ago.
Show quoted text
> It's an improvement, but I still get one failure:
Sorry, Ken, that failing test didn't give me enough information. No idea what's failing there. I've just released 1.92_55[1] with better diagnostics in the 31session.t test. Can you please provide me with make test output again? I hope that it will show me what's up. Thanks, -- andreas [1] ANDK/CPAN-1.92_55.tar.gz


This service runs on Request Tracker, is sponsored by The Perl Foundation, and maintained by Best Practical Solutions.

Please report any issues with rt.cpan.org to rt-cpan-admin@bestpractical.com.