Preferred bug tracker

Please visit the preferred bug tracker to report your issue.

This queue is for tickets about the Perl-Dist-Strawberry CPAN distribution.

Report information
The Basics
Id:
30505
Status:
resolved
Priority:
Low/Low

People
Owner:
Nobody in particular
Requestors:
matt [...] peregrinegrp.net
Cc:
AdminCc:

BugTracker
Severity:
(no value)
Broken in:
(no value)
Fixed in:
(no value)



Subject: Bundle::PPT bug report
Date: Mon, 5 Nov 2007 14:53:34 -0700
To: <bug-Perl-Dist-Strawberry@rt.cpan.org>
From: "Matt Schmalzigan" <matt@peregrinegrp.net>

Hello,

I am trying to install Perl Power Tools module with cpan.pm and there are appears to be a problem with dmake.  The make test failed.  I could force it, but is this wise?  I am not sure what is being tested without looking at the makefile. 

 

Here is the relevant info:

 

Module(Distribution):  Bundle::PPT 0.12

Perl version:  v5.8.8 built for MSWin32-x86-multi-thread

 

OS:  Microsoft Windows XP

 

 

Checking if your kit is complete...

Looks good

Writing Makefile for Make

cp Make.pm blib\lib\Make.pm

C:\strawberry-perl\perl\bin\perl.exe -MExtUtils::Command -e cp pmake blib\script

\pmake

pl2bat.bat blib\script\pmake

  C:\strawberry-perl\dmake\bin\dmake.EXE  -- OK

Running make test

C:\strawberry-perl\perl\bin\perl.exe -MExtUtils::Command -e cp pmake blib\script

\pmake

pl2bat.bat blib\script\pmake

C:\strawberry-perl\perl\bin\perl.exe "-MExtUtils::Command::MM" "-e" "test_harnes

s(0, 'blib\lib', 'blib\arch')" t/*.t

t/make....Reading C:\DOCUME~1\MattS\LOCALS~1\Temp\cpan\build\Make-1.00\blib\lib/

Make.pm

Reading C:\DOCUME~1\MattS\LOCALS~1\Temp\cpan\build\Make-1.00\Makefile

t/make....ok 1/2# Test 2 got: "Cannot recurse Make - no target c:\\strawberry-pe

rl\\perl\\libConfig.pm in C:/DOCUME~1/MattS/LOCALS~1/Temp/cpan/build/Make-1.00 a

t C:\\DOCUME~1\\MattS\\LOCALS~1\\Temp\\cpan\\build\\Make-1.00\\blib\\lib/Make.pm

 line 454.\n" (t/make.t at line 9)

t/make....NOK 2#   Expected: "" (Make all)

#  t/make.t line 9 is: ok($@,'',"Make all");

t/make....FAILED test 2

        Failed 1/2 tests, 50.00% okay

Failed Test Stat Wstat Total Fail  Failed  List of Failed

-------------------------------------------------------------------------------

t/make.t                   2    1  50.00%  2

Failed 1/1 test scripts, 0.00% okay. 1/2 subtests failed, 50.00% okay.

dmake.EXE:  Error code 255, while making 'test_dynamic'

  C:\strawberry-perl\dmake\bin\dmake.EXE test -- NOT OK

Running make install

  make test had returned bad status, won't install without force

Bundle summary: The following items in bundle Bundle::PPT had installation

problems:

  Make

Failed during this command:

  NI-S/Make-1.00.tar.gz                        : make_test NO

 

 

cpan>

 

Thanks for your time.

 

------------------------------------------------------------------------------------

Matt Schmalzigan

Electrical Engineer

 

Peregrine Group

8850 West 38th Avenue Suite A

Wheat Ridge, Colorado 80033

Phone:  303.670.9388

Fax:  303.384.0867

 

Subject: Re: [rt.cpan.org #30505] Bundle::PPT bug report
Date: Tue, 6 Nov 2007 12:07:45 +1100
To: bug-Perl-Dist-Strawberry@rt.cpan.org
From: "Adam Kennedy" <adamkennedybackup@gmail.com>
This would appear to be a problem with Bundle::PPT, not with Strawberry Perl.

Adam K

On 06/11/2007, Matt Schmalzigan via RT < bug-Perl-Dist-Strawberry@rt.cpan.org> wrote:
Show quoted text

Mon Nov 05 16:54:33 2007: Request 30505 was acted upon.
Transaction: Ticket created by matt@peregrinegrp.net
      Queue: Perl-Dist-Strawberry
    Subject: Bundle::PPT bug report
  Broken in: (no value)
   Severity: (no value)
      Owner: Nobody
 Requestors: matt@peregrinegrp.net
     Status: new
 Ticket <URL: http://rt.cpan.org/Ticket/Display.html?id=30505 >


Hello,

I am trying to install Perl Power Tools module with cpan.pm and there are
appears to be a problem with dmake.  The make test failed.  I could force
it, but is this wise?  I am not sure what is being tested without looking at
the makefile.



Here is the relevant info:



Module(Distribution):  Bundle::PPT 0.12

Perl version:  v5.8.8 built for MSWin32-x86-multi-thread



OS:  Microsoft Windows XP





Checking if your kit is complete...

Looks good

Writing Makefile for Make

cp Make.pm blib\lib\Make.pm

C:\strawberry-perl\perl\bin\perl.exe -MExtUtils::Command -e cp pmake
blib\script

\pmake

pl2bat.bat blib\script\pmake

 C:\strawberry-perl\dmake\bin\dmake.EXE  -- OK

Running make test

C:\strawberry-perl\perl\bin\perl.exe -MExtUtils::Command -e cp pmake
blib\script

\pmake

pl2bat.bat blib\script\pmake

C:\strawberry-perl\perl\bin\perl.exe "-MExtUtils::Command::MM" "-e"
"test_harnes

s(0, 'blib\lib', 'blib\arch')" t/*.t

t/make....Reading
C:\DOCUME~1\MattS\LOCALS~1\Temp\cpan\build\Make-1.00\blib\lib/

Make.pm

Reading C:\DOCUME~1\MattS\LOCALS~1\Temp\cpan\build\Make-1.00\Makefile

t/make....ok 1/2# Test 2 got: "Cannot recurse Make - no target
c:\\strawberry-pe

rl\\perl\\libConfig.pm in
C:/DOCUME~1/MattS/LOCALS~1/Temp/cpan/build/Make-1.00 a

t
C:\\DOCUME~1\\MattS\\LOCALS~1\\Temp\\cpan\\build\\Make-1.00\\blib\\lib/Make.
pm

 line 454.\n" (t/make.t at line 9)

t/make....NOK 2#   Expected: "" (Make all)

#  t/make.t line 9 is: ok($@,'',"Make all");

t/make....FAILED test 2

       Failed 1/2 tests, 50.00% okay

Failed Test Stat Wstat Total Fail  Failed  List of Failed

----------------------------------------------------------------------------
---

t/make.t                   2    1  50.00%  2

Failed 1/1 test scripts, 0.00% okay. 1/2 subtests failed, 50.00% okay.

dmake.EXE:  Error code 255, while making 'test_dynamic'

 C:\strawberry-perl\dmake\bin\dmake.EXE test -- NOT OK

Running make install

 make test had returned bad status, won't install without force

Bundle summary: The following items in bundle Bundle::PPT had installation

problems:

 Make

Failed during this command:

 NI-S/Make-1.00.tar.gz                        : make_test NO





cpan>



Thanks for your time.



----------------------------------------------------------------------------
--------

Matt Schmalzigan

Electrical Engineer



Peregrine Group

8850 West 38th Avenue Suite A

Wheat Ridge, Colorado 80033

Phone:  303.670.9388

Fax:  303.384.0867





Hello,

I am trying to install Perl Power Tools module with cpan.pm and there are appears to be a problem with dmake.  The make test failed.  I could force it, but is this wise?  I am not sure what is being tested without looking at the makefile. 

 

Here is the relevant info:

 

Module(Distribution):  Bundle::PPT 0.12

Perl version:  v5.8.8 built for MSWin32-x86-multi-thread

 

OS:  Microsoft Windows XP

 

 

Checking if your kit is complete...

Looks good

Writing Makefile for Make

cp Make.pm blib\lib\Make.pm

C:\strawberry-perl\perl\bin\perl.exe -MExtUtils::Command -e cp pmake blib\script

\pmake

pl2bat.bat blib\script\pmake

  C:\strawberry-perl\dmake\bin\dmake.EXE  -- OK

Running make test

C:\strawberry-perl\perl\bin\perl.exe -MExtUtils::Command -e cp pmake blib\script

\pmake

pl2bat.bat blib\script\pmake

C:\strawberry-perl\perl\bin\perl.exe "-MExtUtils::Command::MM" "-e" "test_harnes

s(0, 'blib\lib', 'blib\arch')" t/*.t

t/make....Reading C:\DOCUME~1\MattS\LOCALS~1\Temp\cpan\build\Make-1.00\blib\lib/

Make.pm

Reading C:\DOCUME~1\MattS\LOCALS~1\Temp\cpan\build\Make-1.00\Makefile

t/make....ok 1/2# Test 2 got: "Cannot recurse Make - no target c:\\strawberry-pe

rl\\perl\\libConfig.pm in C:/DOCUME~1/MattS/LOCALS~1/Temp/cpan/build/Make-1.00 a

t C:\\DOCUME~1\\MattS\\LOCALS~1\\Temp\\cpan\\build\\Make-1.00\\blib\\lib/Make.pm

 line 454.\n" (t/make.t at line 9)

t/make....NOK 2#   Expected: "" (Make all)

#  t/make.t line 9 is: ok($@,'',"Make all");

t/make....FAILED test 2

        Failed 1/2 tests, 50.00% okay

Failed Test Stat Wstat Total Fail  Failed  List of Failed

-------------------------------------------------------------------------------

t/make.t                   2    1  50.00%  2

Failed 1/1 test scripts, 0.00% okay. 1/2 subtests failed, 50.00% okay.

dmake.EXE:  Error code 255, while making 'test_dynamic'

  C:\strawberry-perl\dmake\bin\dmake.EXE test -- NOT OK

Running make install

  make test had returned bad status, won't install without force

Bundle summary: The following items in bundle Bundle::PPT had installation

problems:

  Make

Failed during this command:

  NI-S/Make-1.00.tar.gz                        : make_test NO

 

 

cpan>

 

Thanks for your time.

 

------------------------------------------------------------------------------------

Matt Schmalzigan

Electrical Engineer

 

Peregrine Group

8850 West 38th Avenue Suite A

Wheat Ridge, Colorado 80033

Phone:  303.670.9388

Fax:  303.384.0867

 



Not a problem with Strawberry


This service runs on Request Tracker, is sponsored by The Perl Foundation, and maintained by Best Practical Solutions.

Please report any issues with rt.cpan.org to rt-cpan-admin@bestpractical.com.