Skip Menu |
 

This queue is for tickets about the POE-Component-Client-HTTP CPAN distribution.

Report information
The Basics
Id: 27700
Status: resolved
Priority: 0/
Queue: POE-Component-Client-HTTP

People
Owner: Nobody in particular
Requestors: lleblanc [...] macroelite.ca
Cc:
AdminCc:

Bug Information
Severity: (no value)
Broken in: (no value)
Fixed in: (no value)



Subject: Please mail the following information to bug-POE@rt.cpan.org:
Date: Fri, 22 Jun 2007 16:53:27 -0500
To: bug-POE [...] rt.cpan.org
From: Lenny Leblanc <lleblanc [...] macroelite.ca>
Download image001.jpg
image/jpeg 3k
image001.jpg
Download (untitled) / with headers
text/plain 6.7k
<dt> decrementing extref for session without any at /usr/lib/perl5/site_perl/5.8.8/POE/Resource/Extrefs.pm line 80 POE::Kernel::_data_extref_dec('POE::Kernel=ARRAY(0x8def098)', 'POE::Session=ARRAY(0x967c3a0)', 'poco-client-keepalive') called at /usr/lib/perl5/site_perl/5.8.8/POE/Kernel.pm line 2445 POE::Kernel::refcount_decrement('POE::Kernel=ARRAY(0x8def098)', 4, 'poco-client-keepalive') called at /usr/lib/perl5/site_perl/5.8.8/POE/Component/Client/Keepalive.pm line 783 POE::Component::Client::Keepalive::_shutdown_request('POE::Component::Cl ient::Keepalive=ARRAY(0x967fddc)', 'POE::Kernel=ARRAY(0x8def098)', 'ARRAY(0x96cdb8c)') called at /usr/lib/perl5/site_perl/5.8.8/POE/Component/Client/Keepalive.pm line 747 POE::Component::Client::Keepalive::_ka_shutdown('POE::Component::Client: :Keepalive=ARRAY(0x967fddc)', 'POE::Session=ARRAY(0x967bcd4)', 'POE::Kernel=ARRAY(0x8def098)', 'HASH(0x967bc8c)', 'ka_shutdown', 'POE::Session=ARRAY(0x967c67c)', 'undef', '/usr/lib/perl5/site_perl/5.8.8/POE/Component/Client/Keepalive.pm', 720, ...) called at /usr/lib/perl5/site_perl/5.8.8/POE/Session.pm line 484 POE::Session::_invoke_state('POE::Session=ARRAY(0x967bcd4)', 'POE::Session=ARRAY(0x967c67c)', 'ka_shutdown', 'ARRAY(0x8dc34a4)', '/usr/lib/perl5/site_perl/5.8.8/POE/Component/Client/Keepalive.pm', 720, '_stop') called at /usr/lib/perl5/site_perl/5.8.8/POE/Kernel.pm line 1012 eval {...} called at /usr/lib/perl5/site_perl/5.8.8/POE/Kernel.pm line 998 POE::Kernel::_dispatch_event('POE::Kernel=ARRAY(0x8def098)', 'POE::Session=ARRAY(0x967bcd4)', 'POE::Session=ARRAY(0x967bcd4)', 'ka_shutdown', 2, 'ARRAY(0x8dc34a4)', '/usr/lib/perl5/site_perl/5.8.8/POE/Component/Client/Keepalive.pm', 720, 'ka_shutdown', ...) called at /usr/lib/perl5/site_perl/5.8.8/POE/Kernel.pm line 1708 POE::Kernel::call('POE::Kernel=ARRAY(0x8def098)', 'POE::Component::Client::Keepalive=ARRAY(0x967fddc)', 'ka_shutdown') called at /usr/lib/perl5/site_perl/5.8.8/POE/Component/Client/Keepalive.pm line 720 POE::Component::Client::Keepalive::shutdown('POE::Component::Client::Kee palive=ARRAY(0x967fddc)') called at t/01_request.t line 168 main::client_stop('undef', 'POE::Session=ARRAY(0x967c67c)', 'POE::Kernel=ARRAY(0x8def098)', 'HASH(0x967c6ac)', '_stop', 'POE::Session=ARRAY(0x967c67c)', 'undef', '/usr/lib/perl5/site_perl/5.8.8/POE/Resource/Sessions.pm', 494, ...) called at /usr/lib/perl5/site_perl/5.8.8/POE/Session.pm line 465 POE::Session::_invoke_state('POE::Session=ARRAY(0x967c67c)', 'POE::Session=ARRAY(0x967c67c)', '_stop', 'ARRAY(0x96b46d4)', '/usr/lib/perl5/site_perl/5.8.8/POE/Resource/Sessions.pm', 494, 1182534467.37423) called at /usr/lib/perl5/site_perl/5.8.8/POE/Kernel.pm line 999 eval {...} called at /usr/lib/perl5/site_perl/5.8.8/POE/Kernel.pm line 998 POE::Kernel::_dispatch_event('POE::Kernel=ARRAY(0x8def098)', 'POE::Session=ARRAY(0x967c67c)', 'POE::Session=ARRAY(0x967c67c)', '_stop', 8, 'ARRAY(0x96b46d4)', '/usr/lib/perl5/site_perl/5.8.8/POE/Resource/Sessions.pm', 494, 1182534467.37423, ...) called at /usr/lib/perl5/site_perl/5.8.8/POE/Resource/Sessions.pm line 491 POE::Kernel::_data_ses_stop('POE::Kernel=ARRAY(0x8def098)', 'POE::Session=ARRAY(0x967c67c)') called at /usr/lib/perl5/site_perl/5.8.8/POE/Resource/Signals.pm line 414 POE::Kernel::_data_sig_free_terminated_sessions('POE::Kernel=ARRAY(0x8de f098)') called at /usr/lib/perl5/site_perl/5.8.8/POE/Kernel.pm line 951 POE::Kernel::_dispatch_event('POE::Kernel=ARRAY(0x8def098)', 'POE::Session=ARRAY(0x967c67c)', 'POE::Session=ARRAY(0x967ca78)', '_signal', 16, 'ARRAY(0x96b4aa0)', '/usr/lib/perl5/site_perl/5.8.8/POE/Kernel.pm', 1053, 'undef', ...) called at /usr/lib/perl5/site_perl/5.8.8/POE/Kernel.pm line 1036 POE::Kernel::_dispatch_event('POE::Kernel=ARRAY(0x8def098)', 'POE::Session=ARRAY(0x967c67c)', 'POE::Session=ARRAY(0x967ca78)', 'got_redir_response', 1, 'ARRAY(0x96c4acc)', '/usr/lib/perl5/site_perl/5.8.8/POE/Session.pm', 708, 'got_connect_done', ...) called at /usr/lib/perl5/site_perl/5.8.8/POE/Resource/Events.pm line 257 POE::Kernel::_data_ev_dispatch_due('POE::Kernel=ARRAY(0x8def098)') called at /usr/lib/perl5/site_perl/5.8.8/POE/Loop/Select.pm line 315 POE::Kernel::loop_do_timeslice('POE::Kernel=ARRAY(0x8def098)') called at /usr/lib/perl5/site_perl/5.8.8/POE/Loop/Select.pm line 323 POE::Kernel::loop_run('POE::Kernel=ARRAY(0x8def098)') called at /usr/lib/perl5/site_perl/5.8.8/POE/Kernel.pm line 1254 POE::Kernel::run('POE::Kernel=ARRAY(0x8def098)') called at t/01_request.t line 378 Can't call method "base" on an undefined value at t/01_request.t line 279. Can't call method "base" on an undefined value at t/01_request.t line 279. # Looks like you planned 14 tests but only ran 13. # Looks like you failed 5 tests of 13 run. t/01_request..............dubious Test returned status 5 (wstat 1280, 0x500) DIED. FAILED tests 9-14 Failed 6/14 tests, 57.14% okay t/02_keepalive............ok t/03_head_filter..........ok t/04_chunk_filter.........ok t/05_request..............ok t/06_factory..............ok t/07_proxy................ok t/08_discard..............ok t/09_bad_scheme...........ok t/10_shutdown.............ok t/11_cancel...............ok t/12_pod..................ok t/13_pod_coverage.........skipped all skipped: Test::Pod::Coverage 1.04 required for testing POD coverage t/14_gzipped_content......ok t/50_davis_zerolength.....ok t/51_santos_status........ok t/52_reiss_bad_length.....ok t/53_response_parser......ok t/54_hzheng_head_redir....ok t/55_reiss_double_resp....ok t/56_redirect_excess......ok t/57_joel_immed_cancel....ok t/58_joel_cancel_multi....ok 7/16 # Failed test 'successful request to poe.perl.org' # at t/58_joel_cancel_multi.t line 37. t/58_joel_cancel_multi....NOK 13/16# Looks like you failed 1 test of 16. t/58_joel_cancel_multi....dubious Test returned status 1 (wstat 256, 0x100) DIED. FAILED test 13 Failed 1/16 tests, 93.75% okay Failed Test Stat Wstat Total Fail List of Failed ------------------------------------------------------------------------ ------- t/01_request.t 5 1280 14 7 9-14 t/58_joel_cancel_multi.t 1 256 16 1 13 1 test skipped. Failed 2/23 test scripts. 7/131 subtests failed. Files=23, Tests=131, 321 wallclock secs ( 8.60 cusr + 1.19 csys = 9.79 CPU) Failed 2/23 test programs. 7/131 subtests failed. make: *** [test_dynamic] Error 1 RCAPUTO/POE-Component-Client-HTTP-0.82.tar.gz /usr/bin/make test -- NOT OK Running make install make test had returned bad status, won't install without force Checking for module POE::Component::Client::HTTP: Install of POE::Component::Client::HTTP failed! -- Lenny Leblanc 628 Leila Avenue Winnipeg, Manitoba R2V 3N7 P: 204.338.0233 ext. 202
Download (untitled) / with headers
text/html 13.7k

Message body is not shown because it is too large.

Resolved in the latest release of POE::Component::Client::Keepalive.


This service is sponsored and maintained by Best Practical Solutions and runs on Perl.org infrastructure.

Please report any issues with rt.cpan.org to rt-cpan-admin@bestpractical.com.