Skip Menu |
 

This queue is for tickets about the HTML-FormWizard CPAN distribution.

Report information
The Basics
Id: 255
Status: new
Priority: 0/
Queue: HTML-FormWizard

People
Owner: Nobody in particular
Requestors: arnaud [...] romeconcept.com
Cc:
AdminCc:

Bug Information
Severity: (no value)
Broken in: (no value)
Fixed in: (no value)



Subject: FAIL HTML-FormWizard-0.1.07 i386-linux 2.4.8-11mdkenterprise
To: cpan-testers [...] perl.org
Cc: bug-HTML-FormWizard [...] rt.cpan.org
Date: Wed, 6 Feb 2002 16:04:14 +0100 (CET)
From: arnaud [...] romeconcept.com (ASSAD Arnaud)
This distribution has been tested as part of the cpan-testers effort to test as many new uploads to CPAN as possible. See http://testers.cpan.org/ Please cc any replies to cpan-testers@perl.org to keep other test volunteers informed and to prevent any duplicate effort. -- PERL_DL_NONLAZY=1 /usr/bin/perl -Iblib/arch -Iblib/lib -I/usr/lib/perl5/5.6.1/i386-linux -I/usr/lib/perl5/5.6.1 test.pl test1....False [] range "\s-" before HERE mark in regex m/^(\+\d{1,3})? ?([\(-\s])?\d{1,3}?([\s- << HERE \)])[\d\s\-]+$/ at blib/lib/HTML/FormWizard.pm line 139. False [] range "\(-\s" before HERE mark in regex m/^(\+\d{1,3})? ?([\(-\s << HERE ])?\d{1,3}?([\s-\)])[\d\s\-]+$/ at blib/lib/HTML/FormWizard.pm line 139. Global symbol "$zbr" requires explicit package name at blib/lib/HTML/FormWizard.pm line 171. syntax error at blib/lib/HTML/FormWizard.pm line 175, near ")) " syntax error at blib/lib/HTML/FormWizard.pm line 177, near "} else" Compilation failed in require at test1.pl line 6. BEGIN failed--compilation aborted at test1.pl line 6. test1....dubious Test returned status 255 (wstat 65280, 0xff00) DIED. FAILED test 1 Failed 1/1 tests, 0.00% okay test2....False [] range "\s-" before HERE mark in regex m/^(\+\d{1,3})? ?([\(-\s])?\d{1,3}?([\s- << HERE \)])[\d\s\-]+$/ at blib/lib/HTML/FormWizard.pm line 139. False [] range "\(-\s" before HERE mark in regex m/^(\+\d{1,3})? ?([\(-\s << HERE ])?\d{1,3}?([\s-\)])[\d\s\-]+$/ at blib/lib/HTML/FormWizard.pm line 139. Global symbol "$zbr" requires explicit package name at blib/lib/HTML/FormWizard.pm line 171. syntax error at blib/lib/HTML/FormWizard.pm line 175, near ")) " syntax error at blib/lib/HTML/FormWizard.pm line 177, near "} else" Compilation failed in require at test2.pl line 6. BEGIN failed--compilation aborted at test2.pl line 6. test2....dubious Test returned status 255 (wstat 65280, 0xff00) DIED. FAILED tests 1-12 Failed 12/12 tests, 0.00% okay test3....False [] range "\s-" before HERE mark in regex m/^(\+\d{1,3})? ?([\(-\s])?\d{1,3}?([\s- << HERE \)])[\d\s\-]+$/ at blib/lib/HTML/FormWizard.pm line 139. False [] range "\(-\s" before HERE mark in regex m/^(\+\d{1,3})? ?([\(-\s << HERE ])?\d{1,3}?([\s-\)])[\d\s\-]+$/ at blib/lib/HTML/FormWizard.pm line 139. Global symbol "$zbr" requires explicit package name at blib/lib/HTML/FormWizard.pm line 171. syntax error at blib/lib/HTML/FormWizard.pm line 175, near ")) " syntax error at blib/lib/HTML/FormWizard.pm line 177, near "} else" Compilation failed in require at test3.pl line 7. BEGIN failed--compilation aborted at test3.pl line 7. test3....dubious Test returned status 255 (wstat 65280, 0xff00) DIED. FAILED tests 1-11 Failed 11/11 tests, 0.00% okay Failed Test Stat Wstat Total Fail Failed List of Failed ------------------------------------------------------------------------------- test1.pl 255 65280 1 1 100.00% 1 test2.pl 255 65280 12 12 100.00% 1-12 test3.pl 255 65280 11 11 100.00% 1-11 Failed 3/3 test scripts, 0.00% okay. 24/24 subtests failed, 0.00% okay. make: *** [test_dynamic] Erreur 9 -- Summary of my perl5 (revision 5.0 version 6 subversion 1) configuration: Platform: osname=linux, osvers=2.4.8-11mdkenterprise, archname=i386-linux uname='linux no.mandrakesoft.com 2.4.8-11mdkenterprise #1 smp wed aug 22 16:05:18 cest 2001 i686 unknown ' config_args='-des -Darchname=i386-linux -Dd_dosuid -Ud_csh -Duseshrplib -Doptimize=-O3 -fomit-frame-pointer -pipe -mcpu=pentiumpro -march=i586 -ffast-math -fno-strength-reduce -Dprefix=/usr -Di_ndbm -Di_gdbm -Di_shadow -Di_syslog -Uuselargefiles -Dman1dir=/usr/share/man/man1 -Dman3dir=/usr/lib/perl5/man/man3' hint=recommended, useposix=true, d_sigaction=define usethreads=undef use5005threads=undef useithreads=undef usemultiplicity=undef useperlio=undef d_sfio=undef uselargefiles=undef usesocks=undef use64bitint=undef use64bitall=undef uselongdouble=undef Compiler: cc='cc', ccflags ='-fno-strict-aliasing', optimize='-O3 -fomit-frame-pointer -pipe -mcpu=pentiumpro -march=i586 -ffast-math -fno-strength-reduce', cppflags='-fno-strict-aliasing' ccversion='', gccversion='2.96 20000731 (Mandrake Linux 8.1 2.96-0.62mdk)', gccosandvers='' intsize=4, longsize=4, ptrsize=4, doublesize=8, byteorder=1234 d_longlong=define, longlongsize=8, d_longdbl=define, longdblsize=12 ivtype='long', ivsize=4, nvtype='double', nvsize=8, Off_t='off_t', lseeksize=4 alignbytes=4, usemymalloc=n, prototype=define Linker and Libraries: ld='cc', ldflags =' -L/usr/local/lib' libpth=/usr/local/lib /lib /usr/lib libs=-lnsl -ldl -lm -lc -lcrypt -lutil perllibs=-lnsl -ldl -lm -lc -lcrypt -lutil libc=/lib/libc-2.2.4.so, so=so, useshrplib=true, libperl=libperl.so Dynamic Linking: dlsrc=dl_dlopen.xs, dlext=so, d_dlsymun=undef, ccdlflags='-rdynamic -Wl,-rpath,/usr/lib/perl5/5.6.1/i386-linux/CORE' cccdlflags='-fpic', lddlflags='-shared -L/usr/local/lib'


This service is sponsored and maintained by Best Practical Solutions and runs on Perl.org infrastructure.

Please report any issues with rt.cpan.org to rt-cpan-admin@bestpractical.com.