Preferred bug tracker

Please visit the preferred bug tracker to report your issue.

This queue is for tickets about the DBD-mysql CPAN distribution.

Report information
The Basics
Id:
24815
Status:
rejected
Priority:
Low/Low
Queue:

People
Owner:
Nobody in particular
Requestors:
LGODDARD [...] cpan.org
Cc:
AdminCc:

BugTracker
Severity:
Critical
Broken in:
1.2212
Fixed in:
(no value)



Subject: Fails tests on Linux Perl 5.8.8, latest DBI
A buffer-full of failed test output, followed by perl -V: please let me know if more info will help. dbdimp.c: In function 'mysql_bind_ph': dbdimp.c:4259: warning: 'buffer' may be used uninitialized in this function /usr/bin/perl -p - e "s/~DRIVER~/mysql/g" /usr/lib/perl5/site_perl/5.8.8/i586-linux- thread-multi/auto/DBI/Driver.xst > mysql.xsi /usr/bin/perl /usr/lib/perl5/5.8.8/ExtUtils/xsubpp - typemap /usr/lib/perl5/5.8.8/ExtUtils/typemap mysql.xs > mysql.xsc && mv mysql.xsc mysql.c Warning: duplicate function definition 'do' detected in mysql.xs, line 254 Warning: duplicate function definition 'rows' detected in mysql.xs, line 658 cc -c -I/usr/lib/perl5/site_perl/5.8.8/i586-linux-thread- multi/auto/DBI -I/usr/include/mysql -march=i586 -mtune=i686 -fmessage- length=0 -D_FORTIFY_SOURCE=2 -g -DPIC -fPIC -DUNDEF_HAVE_INITGROUPS - fno-strict-aliasing -DDBD_MYSQL_INSERT_ID_IS_GOOD -g -D_REENTRANT - D_GNU_SOURCE -DTHREADS_HAVE_PIDS -DDEBUGGING -fno-strict-aliasing - pipe -Wdeclaration-after-statement -D_LARGEFILE_SOURCE - D_FILE_OFFSET_BITS=64 -O2 -march=i586 -mtune=i686 -fmessage-length=0 - Wall -D_FORTIFY_SOURCE=2 -g -Wall -pipe -DVERSION=\"4.001\" - DXS_VERSION=\"4.001\" -fPIC "-I/usr/lib/perl5/5.8.8/i586-linux-thread- multi/CORE" mysql.c mysql.xs: In function 'XS_DBD__mysql__db_do': mysql.xs:268: warning: unused variable 'statement_ptr' mysql.xs: In function 'XS_DBD__mysql__st_more_results': mysql.xs:581: warning: implicit declaration of function 'mysql_st_next_results' mysql.xs:580: warning: unused variable 'retval' mysql.xs: In function 'XS_DBD__mysql__GetInfo_dbd_mysql_get_info': mysql.xs:732: warning: implicit declaration of function 'is_prefix' Running Mkbootstrap for DBD::mysql () chmod 644 mysql.bs rm -f blib/arch/auto/DBD/mysql/mysql.so LD_RUN_PATH="/usr/lib/mysql:/lib" /usr/bin/perl myld cc -shared dbdimp.o mysql.o -o blib/arch/auto/DBD/mysql/mysql.so \ -L/usr/lib/mysql -lmysqlclient -lz -lcrypt -lnsl -lm \ chmod 755 blib/arch/auto/DBD/mysql/mysql.so cp mysql.bs blib/arch/auto/DBD/mysql/mysql.bs chmod 644 blib/arch/auto/DBD/mysql/mysql.bs Manifying blib/man3/DBD::mysql.3pm Manifying blib/man3/DBD::mysql::INSTALL.3pm Manifying blib/man3/Bundle::DBD::mysql.3pm /usr/bin/make -- OK Running make test PERL_DL_NONLAZY=1 /usr/bin/perl "-MExtUtils::Command::MM" "- e" "test_harness(0, 'blib/lib', 'blib/arch')" t/*.t t/00base.............ok t/10dsnlist..........DBI connect('test','',...) failed: Access denied for user 'root'@'localhost' (using password: NO) at t/10dsnlist.t line 45 Cannot connect: Access denied for user 'root'@'localhost' (using password: NO) Either your server is not up and running or you have no permissions for acessing the DSN DBI:mysql:test. This test requires a running server and write permissions. Please make sure your server is running and you have permissions, then retry. t/10dsnlist..........dubious Test returned status 10 (wstat 2560, 0xa00) DIED. FAILED tests 1-9 Failed 9/9 tests, 0.00% okay t/20createdrop.......DBI connect('test','',...) failed: Access denied for user 'root'@'localhost' (using password: NO) at t/20createdrop.t line 45 Cannot connect: Access denied for user 'root'@'localhost' (using password: NO) Either your server is not up and running or you have no permissions for acessing the DSN DBI:mysql:test. This test requires a running server and write permissions. Please make sure your server is running and you have permissions, then retry. t/20createdrop.......dubious Test returned status 10 (wstat 2560, 0xa00) DIED. FAILED tests 1-5 Failed 5/5 tests, 0.00% okay t/30insertfetch......DBI connect('test','',...) failed: Access denied for user 'root'@'localhost' (using password: NO) at t/30insertfetch.t line 48 Cannot connect: Access denied for user 'root'@'localhost' (using password: NO) Either your server is not up and running or you have no permissions for acessing the DSN DBI:mysql:test. This test requires a running server and write permissions. Please make sure your server is running and you have permissions, then retry. t/30insertfetch......dubious Test returned status 10 (wstat 2560, 0xa00) DIED. FAILED tests 1-11 Failed 11/11 tests, 0.00% okay t/35limit............DBI connect('test','',...) failed: Access denied for user 'root'@'localhost' (using password: NO) at t/35limit.t line 50 Cannot connect: Access denied for user 'root'@'localhost' (using password: NO) Either your server is not up and running or you have no permissions for acessing the DSN DBI:mysql:test. This test requires a running server and write permissions. Please make sure your server is running and you have permissions, then retry. t/35limit............dubious Test returned status 10 (wstat 2560, 0xa00) DIED. FAILED tests 1-113 Failed 113/113 tests, 0.00% okay t/35prepare..........DBI connect('test','',...) failed: Access denied for user 'root'@'localhost' (using password: NO) at t/35prepare.t line 35 t/35prepare..........dubious Test returned status 255 (wstat 65280, 0xff00) DIED. FAILED tests 1-40 Failed 40/40 tests, 0.00% okay t/40bindparam........DBI connect('test','',...) failed: Access denied for user 'root'@'localhost' (using password: NO) at t/40bindparam.t line 57 t/40bindparam........dubious Test returned status 255 (wstat 65280, 0xff00) t/40bindparam2.......DBI connect('test','',...) failed: Access denied for user 'root'@'localhost' (using password: NO) at t/40bindparam2.t line 64 Cannot connect: Access denied for user 'root'@'localhost' (using password: NO) Either your server is not up and running or you have no permissions for acessing the DSN DBI:mysql:test. This test requires a running server and write permissions. Please make sure your server is running and you have permissions, then retry. t/40bindparam2.......dubious Test returned status 10 (wstat 2560, 0xa00) DIED. FAILED tests 1-13 Failed 13/13 tests, 0.00% okay t/40blobs............DBI connect('test','',...) failed: Access denied for user 'root'@'localhost' (using password: NO) at t/40blobs.t line 64 Cannot connect: Access denied for user 'root'@'localhost' (using password: NO) Either your server is not up and running or you have no permissions for acessing the DSN DBI:mysql:test. This test requires a running server and write permissions. Please make sure your server is running and you have permissions, then retry. t/40blobs............dubious Test returned status 10 (wstat 2560, 0xa00) DIED. FAILED tests 1-11 Failed 11/11 tests, 0.00% okay t/40listfields.......DBI connect('test','',...) failed: Access denied for user 'root'@'localhost' (using password: NO) at t/40listfields.t line 57 Cannot connect: Access denied for user 'root'@'localhost' (using password: NO) Either your server is not up and running or you have no permissions for acessing the DSN DBI:mysql:test. This test requires a running server and write permissions. Please make sure your server is running and you have permissions, then retry. t/40listfields.......dubious Test returned status 10 (wstat 2560, 0xa00) DIED. FAILED tests 1-19 Failed 19/19 tests, 0.00% okay t/40nulls............DBI connect('test','',...) failed: Access denied for user 'root'@'localhost' (using password: NO) at t/40nulls.t line 50 Cannot connect: Access denied for user 'root'@'localhost' (using password: NO) Either your server is not up and running or you have no permissions for acessing the DSN DBI:mysql:test. This test requires a running server and write permissions. Please make sure your server is running and you have permissions, then retry. t/40nulls............dubious Test returned status 10 (wstat 2560, 0xa00) DIED. FAILED tests 1-11 Failed 11/11 tests, 0.00% okay t/40numrows..........DBI connect('test','',...) failed: Access denied for user 'root'@'localhost' (using password: NO) at t/40numrows.t line 59 Cannot connect: Access denied for user 'root'@'localhost' (using password: NO) Either your server is not up and running or you have no permissions for acessing the DSN DBI:mysql:test. This test requires a running server and write permissions. Please make sure your server is running and you have permissions, then retry. t/40numrows..........dubious Test returned status 10 (wstat 2560, 0xa00) DIED. FAILED tests 1-25 Failed 25/25 tests, 0.00% okay t/41bindparam........DBI connect('test','',...) failed: Access denied for user 'root'@'localhost' (using password: NO) at t/41bindparam.t line 37 t/41bindparam........dubious Test returned status 255 (wstat 65280, 0xff00) DIED. FAILED tests 1-11 Failed 11/11 tests, 0.00% okay t/41blobs_prepare....DBI connect('test','',...) failed: Access denied for user 'root'@'localhost' (using password: NO) at t/41blobs_prepare.t line 71 Cannot connect: Access denied for user 'root'@'localhost' (using password: NO) Either your server is not up and running or you have no permissions for acessing the DSN DBI:mysql:test. This test requires a running server and write permissions. Please make sure your server is running and you have permissions, then retry. t/41blobs_prepare....dubious Test returned status 10 (wstat 2560, 0xa00) DIED. FAILED tests 1-24 Failed 24/24 tests, 0.00% okay t/42bindparam........DBI connect('test','',...) failed: Access denied for user 'root'@'localhost' (using password: NO) at t/42bindparam.t line 37 t/42bindparam........dubious Test returned status 255 (wstat 65280, 0xff00) DIED. FAILED tests 1-11 Failed 11/11 tests, 0.00% okay t/50chopblanks.......DBI connect('test','',...) failed: Access denied for user 'root'@'localhost' (using password: NO) at t/50chopblanks.t line 57 Cannot connect: Access denied for user 'root'@'localhost' (using password: NO) Either your server is not up and running or you have no permissions for acessing the DSN DBI:mysql:test. This test requires a running server and write permissions. Please make sure your server is running and you have permissions, then retry. t/50chopblanks.......dubious Test returned status 10 (wstat 2560, 0xa00) DIED. FAILED tests 1-35 Failed 35/35 tests, 0.00% okay t/50commit...........DBI connect('test','',...) failed: Access denied for user 'root'@'localhost' (using password: NO) at t/50commit.t line 64 Can't call method "tables" on an undefined value at t/lib.pl line 232. t/50commit...........dubious Test returned status 255 (wstat 65280, 0xff00) DIED. FAILED tests 1-30 Failed 30/30 tests, 0.00% okay t/60leaks............skipped all skipped: $ENV{SLOW_TESTS} is not set t/70takeimp..........skipped all skipped: test feature not implemented t/75supported_sql....DBI connect('test','',...) failed: Access denied for user 'root'@'localhost' (using password: NO) at t/75supported_sql.t line 35 t/75supported_sql....dubious Test returned status 255 (wstat 65280, 0xff00) DIED. FAILED tests 1-17 Failed 17/17 tests, 0.00% okay t/80procs............DBI connect('test','',...) failed: Access denied for user 'root'@'localhost' (using password: NO) at t/80procs.t line 32 t/80procs............dubious Test returned status 255 (wstat 65280, 0xff00) t/insertid...........DBI connect('test','',...) failed: Access denied for user 'root'@'localhost' (using password: NO) at t/insertid.t line 13 t/insertid...........dubious Test returned status 255 (wstat 65280, 0xff00) DIED. FAILED tests 1-12 Failed 12/12 tests, 0.00% okay t/param_values.......DBI connect('test','',...) failed: Access denied for user 'root'@'localhost' (using password: NO) at t/param_values.t line 16 Can't call method "tables" on an undefined value at t/lib.pl line 232. t/param_values.......dubious Test returned status 255 (wstat 65280, 0xff00) DIED. FAILED tests 1-8 Failed 8/8 tests, 0.00% okay t/prepare_noerror....DBI connect('test','',...) failed: Access denied for user 'root'@'localhost' (using password: NO) at t/prepare_noerror.t line 22 Can't call method "prepare" on an undefined value at t/prepare_noerror.t line 25. t/prepare_noerror....dubious Test returned status 255 (wstat 65280, 0xff00) t/texecute...........DBI connect('test','',...) failed: Access denied for user 'root'@'localhost' (using password: NO) at t/texecute.t line 17 Can't call method "tables" on an undefined value at t/lib.pl line 232. t/texecute...........dubious Test returned status 255 (wstat 65280, 0xff00) DIED. FAILED tests 1-9 Failed 9/9 tests, 0.00% okay t/utf8...............DBI connect('test','',...) failed: Access denied for user 'root'@'localhost' (using password: NO) at t/utf8.t line 49 t/utf8...............dubious Test returned status 255 (wstat 65280, 0xff00) Failed Test Stat Wstat Total Fail List of Failed ----------------------------------------------------------------------- ----------------------------------------------------------------------- ----------------- t/10dsnlist.t 10 2560 9 17 1-9 t/20createdrop.t 10 2560 5 9 1-5 t/30insertfetch.t 10 2560 11 21 1-11 t/35limit.t 10 2560 113 225 1-113 t/35prepare.t 255 65280 40 80 1-40 t/40bindparam.t 255 65280 ?? ?? ?? t/40bindparam2.t 10 2560 13 25 1-13 t/40blobs.t 10 2560 11 21 1-11 t/40listfields.t 10 2560 19 37 1-19 t/40nulls.t 10 2560 11 21 1-11 t/40numrows.t 10 2560 25 49 1-25 t/41bindparam.t 255 65280 11 22 1-11 t/41blobs_prepare.t 10 2560 24 47 1-24 t/42bindparam.t 255 65280 11 22 1-11 t/50chopblanks.t 10 2560 35 69 1-35 t/50commit.t 255 65280 30 59 1-30 t/75supported_sql.t 255 65280 17 34 1-17 t/80procs.t 255 65280 ?? ?? ?? t/insertid.t 255 65280 12 24 1-12 t/param_values.t 255 65280 8 15 1-8 t/prepare_noerror.t 255 65280 ?? ?? ?? t/texecute.t 255 65280 9 17 1-9 t/utf8.t 255 65280 ?? ?? ?? 2 tests skipped. Failed 23/26 test scripts. 414/419 subtests failed. Files=26, Tests=419, 1 wallclock secs ( 1.24 cusr + 0.18 csys = 1.42 CPU) Failed 23/26 test programs. 414/419 subtests failed. make: *** [test_dynamic] Error 255 /usr/bin/make test -- NOT OK Running make install make test had returned bad status, won't install without force Failed during this command: CAPTTOFU/DBD-mysql-4.001.tar.gz : make_test NO Summary of my perl5 (revision 5 version 8 subversion 8) configuration: Platform: osname=linux, osvers=2.6.16, archname=i586-linux-thread-multi uname='linux tait 2.6.16 #1 smp tue mar 14 18:04:33 utc 2006 i686 i686 i386 gnulinux ' config_args='-ds -e -Dprefix=/usr -Dvendorprefix=/usr - Dinstallusrbinperl -Dusethreads -Di_db -Di_dbm -Di_ndbm -Di_gdbm - Duseshrplib=true -Doptimize=-O2 -march=i586 -mtune=i686 -fmessage- length=0 -Wall -D_FORTIFY_SOURCE=2 -g -Wall -pipe' hint=recommended, useposix=true, d_sigaction=define usethreads=define use5005threads=undef useithreads=define usemultiplicity=define useperlio=define d_sfio=undef uselargefiles=define usesocks=undef use64bitint=undef use64bitall=undef uselongdouble=undef usemymalloc=n, bincompat5005=undef Compiler: cc='cc', ccflags ='-D_REENTRANT -D_GNU_SOURCE -DTHREADS_HAVE_PIDS - DDEBUGGING -fno-strict-aliasing -pipe -Wdeclaration-after-statement - D_LARGEFILE_SOURCE -D_FILE_OFFSET_BITS=64', optimize='-O2 -march=i586 -mtune=i686 -fmessage-length=0 -Wall - D_FORTIFY_SOURCE=2 -g -Wall -pipe', cppflags='-D_REENTRANT -D_GNU_SOURCE -DTHREADS_HAVE_PIDS - DDEBUGGING -fno-strict-aliasing -pipe -Wdeclaration-after-statement' ccversion='', gccversion='4.1.0 (SUSE Linux)', gccosandvers='' intsize=4, longsize=4, ptrsize=4, doublesize=8, byteorder=1234 d_longlong=define, longlongsize=8, d_longdbl=define, longdblsize=12 ivtype='long', ivsize=4, nvtype='double', nvsize=8, Off_t='off_t', lseeksize=8 alignbytes=4, prototype=define Linker and Libraries: ld='cc', ldflags ='' libpth=/lib /usr/lib /usr/local/lib libs=-lnsl -ldl -lm -lcrypt -lutil -lpthread -lc perllibs=-lnsl -ldl -lm -lcrypt -lutil -lpthread -lc libc=/lib/libc-2.4.so, so=so, useshrplib=true, libperl=libperl.so gnulibc_version='2.4' Dynamic Linking: dlsrc=dl_dlopen.xs, dlext=so, d_dlsymun=undef, ccdlflags='-Wl,-E - Wl,-rpath,/usr/lib/perl5/5.8.8/i586-linux-thread-multi/CORE' cccdlflags='-fPIC', lddlflags='-shared' Characteristics of this binary (from libperl): Compile-time options: DEBUGGING MULTIPLICITY PERL_IMPLICIT_CONTEXT PERL_MALLOC_WRAP THREADS_HAVE_PIDS USE_ITHREADS USE_LARGE_FILES USE_PERLIO USE_REENTRANT_API Built under linux Compiled at Apr 23 2006 00:26:41 @INC: /usr/lib/perl5/5.8.8/i586-linux-thread-multi /usr/lib/perl5/5.8.8 /usr/lib/perl5/site_perl/5.8.8/i586-linux-thread-multi /usr/lib/perl5/site_perl/5.8.8 /usr/lib/perl5/site_perl /usr/lib/perl5/vendor_perl/5.8.8/i586-linux-thread-multi /usr/lib/perl5/vendor_perl/5.8.8 /usr/lib/perl5/vendor_perl . l
The test failures all indicate that there isn't a MySQL server running, or that the default test DSN is not enough to find it. Are you sure a MySQL server is running? Is the socket for it where libmysql expects it to be?
Please do this: perl Makefile.PL --testuser=root --testpassword=yourpassword or perl Makefile.PL --testuser=someotheruserwhocanwritetotestdatabase --testpassword=passwordofsomeotheruser You need to always make sure that whatever user 'make test' runs as, has access to the database "test". On Tue Feb 06 03:59:50 2007, LGODDARD wrote:
Show quoted text
> A buffer-full of failed test output, followed by perl -V: please let > me know if more info will help. > > dbdimp.c: In function 'mysql_bind_ph': > dbdimp.c:4259: warning: 'buffer' may be used uninitialized in this > function > /usr/bin/perl -p - > e "s/~DRIVER~/mysql/g" /usr/lib/perl5/site_perl/5.8.8/i586-linux- > thread-multi/auto/DBI/Driver.xst > mysql.xsi > /usr/bin/perl /usr/lib/perl5/5.8.8/ExtUtils/xsubpp - > typemap /usr/lib/perl5/5.8.8/ExtUtils/typemap mysql.xs > mysql.xsc && > mv mysql.xsc mysql.c > Warning: duplicate function definition 'do' detected in mysql.xs, line > 254 > Warning: duplicate function definition 'rows' detected in mysql.xs, > line 658 > cc -c -I/usr/lib/perl5/site_perl/5.8.8/i586-linux-thread- > multi/auto/DBI -I/usr/include/mysql -march=i586 -mtune=i686 -fmessage- > length=0 -D_FORTIFY_SOURCE=2 -g -DPIC -fPIC -DUNDEF_HAVE_INITGROUPS - > fno-strict-aliasing -DDBD_MYSQL_INSERT_ID_IS_GOOD -g -D_REENTRANT - > D_GNU_SOURCE -DTHREADS_HAVE_PIDS -DDEBUGGING -fno-strict-aliasing - > pipe -Wdeclaration-after-statement -D_LARGEFILE_SOURCE - > D_FILE_OFFSET_BITS=64 -O2 -march=i586 -mtune=i686 -fmessage-length=0 - > Wall -D_FORTIFY_SOURCE=2 -g -Wall -pipe -DVERSION=\"4.001\" - > DXS_VERSION=\"4.001\" -fPIC "-I/usr/lib/perl5/5.8.8/i586-linux-thread- > multi/CORE" mysql.c > mysql.xs: In function 'XS_DBD__mysql__db_do': > mysql.xs:268: warning: unused variable 'statement_ptr' > mysql.xs: In function 'XS_DBD__mysql__st_more_results': > mysql.xs:581: warning: implicit declaration of > function 'mysql_st_next_results' > mysql.xs:580: warning: unused variable 'retval' > mysql.xs: In function 'XS_DBD__mysql__GetInfo_dbd_mysql_get_info': > mysql.xs:732: warning: implicit declaration of function 'is_prefix' > Running Mkbootstrap for DBD::mysql () > chmod 644 mysql.bs > rm -f blib/arch/auto/DBD/mysql/mysql.so > LD_RUN_PATH="/usr/lib/mysql:/lib" /usr/bin/perl myld cc -shared > dbdimp.o mysql.o -o blib/arch/auto/DBD/mysql/mysql.so \ > -L/usr/lib/mysql -lmysqlclient -lz -lcrypt -lnsl -lm \ > > chmod 755 blib/arch/auto/DBD/mysql/mysql.so > cp mysql.bs blib/arch/auto/DBD/mysql/mysql.bs > chmod 644 blib/arch/auto/DBD/mysql/mysql.bs > Manifying blib/man3/DBD::mysql.3pm > Manifying blib/man3/DBD::mysql::INSTALL.3pm > Manifying blib/man3/Bundle::DBD::mysql.3pm > /usr/bin/make -- OK > Running make test > PERL_DL_NONLAZY=1 /usr/bin/perl "-MExtUtils::Command::MM" "- > e" "test_harness(0, 'blib/lib', 'blib/arch')" t/*.t > t/00base.............ok > t/10dsnlist..........DBI connect('test','',...) failed: Access denied > for user 'root'@'localhost' (using password: NO) at t/10dsnlist.t line > 45 > Cannot connect: Access denied for user 'root'@'localhost' (using > password: NO) > Either your server is not up and running or you have no > permissions for acessing the DSN DBI:mysql:test. > This test requires a running server and write permissions. > Please make sure your server is running and you have > permissions, then retry. > t/10dsnlist..........dubious > Test returned status 10 (wstat 2560, 0xa00) > DIED. FAILED tests 1-9 > Failed 9/9 tests, 0.00% okay > t/20createdrop.......DBI connect('test','',...) failed: Access denied > for user 'root'@'localhost' (using password: NO) at t/20createdrop.t > line 45 > Cannot connect: Access denied for user 'root'@'localhost' (using > password: NO) > Either your server is not up and running or you have no > permissions for acessing the DSN DBI:mysql:test. > This test requires a running server and write permissions. > Please make sure your server is running and you have > permissions, then retry. > t/20createdrop.......dubious > Test returned status 10 (wstat 2560, 0xa00) > DIED. FAILED tests 1-5 > Failed 5/5 tests, 0.00% okay > t/30insertfetch......DBI connect('test','',...) failed: Access denied > for user 'root'@'localhost' (using password: NO) at t/30insertfetch.t > line 48 > Cannot connect: Access denied for user 'root'@'localhost' (using > password: NO) > Either your server is not up and running or you have no > permissions for acessing the DSN DBI:mysql:test. > This test requires a running server and write permissions. > Please make sure your server is running and you have > permissions, then retry. > t/30insertfetch......dubious > Test returned status 10 (wstat 2560, 0xa00) > DIED. FAILED tests 1-11 > Failed 11/11 tests, 0.00% okay > t/35limit............DBI connect('test','',...) failed: Access denied > for user 'root'@'localhost' (using password: NO) at t/35limit.t line 50 > Cannot connect: Access denied for user 'root'@'localhost' (using > password: NO) > Either your server is not up and running or you have no > permissions for acessing the DSN DBI:mysql:test. > This test requires a running server and write permissions. > Please make sure your server is running and you have > permissions, then retry. > t/35limit............dubious > Test returned status 10 (wstat 2560, 0xa00) > DIED. FAILED tests 1-113 > Failed 113/113 tests, 0.00% okay > t/35prepare..........DBI connect('test','',...) failed: Access denied > for user 'root'@'localhost' (using password: NO) at t/35prepare.t line > 35 > t/35prepare..........dubious > Test returned status 255 (wstat 65280, 0xff00) > DIED. FAILED tests 1-40 > Failed 40/40 tests, 0.00% okay > t/40bindparam........DBI connect('test','',...) failed: Access denied > for user 'root'@'localhost' (using password: NO) at t/40bindparam.t > line 57 > t/40bindparam........dubious > Test returned status 255 (wstat 65280, 0xff00) > t/40bindparam2.......DBI connect('test','',...) failed: Access denied > for user 'root'@'localhost' (using password: NO) at t/40bindparam2.t > line 64 > Cannot connect: Access denied for user 'root'@'localhost' (using > password: NO) > Either your server is not up and running or you have no > permissions for acessing the DSN DBI:mysql:test. > This test requires a running server and write permissions. > Please make sure your server is running and you have > permissions, then retry. > t/40bindparam2.......dubious > Test returned status 10 (wstat 2560, 0xa00) > DIED. FAILED tests 1-13 > Failed 13/13 tests, 0.00% okay > t/40blobs............DBI connect('test','',...) failed: Access denied > for user 'root'@'localhost' (using password: NO) at t/40blobs.t line 64 > Cannot connect: Access denied for user 'root'@'localhost' (using > password: NO) > Either your server is not up and running or you have no > permissions for acessing the DSN DBI:mysql:test. > This test requires a running server and write permissions. > Please make sure your server is running and you have > permissions, then retry. > t/40blobs............dubious > Test returned status 10 (wstat 2560, 0xa00) > DIED. FAILED tests 1-11 > Failed 11/11 tests, 0.00% okay > t/40listfields.......DBI connect('test','',...) failed: Access denied > for user 'root'@'localhost' (using password: NO) at t/40listfields.t > line 57 > Cannot connect: Access denied for user 'root'@'localhost' (using > password: NO) > Either your server is not up and running or you have no > permissions for acessing the DSN DBI:mysql:test. > This test requires a running server and write permissions. > Please make sure your server is running and you have > permissions, then retry. > t/40listfields.......dubious > Test returned status 10 (wstat 2560, 0xa00) > DIED. FAILED tests 1-19 > Failed 19/19 tests, 0.00% okay > t/40nulls............DBI connect('test','',...) failed: Access denied > for user 'root'@'localhost' (using password: NO) at t/40nulls.t line 50 > Cannot connect: Access denied for user 'root'@'localhost' (using > password: NO) > Either your server is not up and running or you have no > permissions for acessing the DSN DBI:mysql:test. > This test requires a running server and write permissions. > Please make sure your server is running and you have > permissions, then retry. > t/40nulls............dubious > Test returned status 10 (wstat 2560, 0xa00) > DIED. FAILED tests 1-11 > Failed 11/11 tests, 0.00% okay > t/40numrows..........DBI connect('test','',...) failed: Access denied > for user 'root'@'localhost' (using password: NO) at t/40numrows.t line > 59 > Cannot connect: Access denied for user 'root'@'localhost' (using > password: NO) > Either your server is not up and running or you have no > permissions for acessing the DSN DBI:mysql:test. > This test requires a running server and write permissions. > Please make sure your server is running and you have > permissions, then retry. > t/40numrows..........dubious > Test returned status 10 (wstat 2560, 0xa00) > DIED. FAILED tests 1-25 > Failed 25/25 tests, 0.00% okay > t/41bindparam........DBI connect('test','',...) failed: Access denied > for user 'root'@'localhost' (using password: NO) at t/41bindparam.t > line 37 > t/41bindparam........dubious > Test returned status 255 (wstat 65280, 0xff00) > DIED. FAILED tests 1-11 > Failed 11/11 tests, 0.00% okay > t/41blobs_prepare....DBI connect('test','',...) failed: Access denied > for user 'root'@'localhost' (using password: NO) at > t/41blobs_prepare.t line 71 > Cannot connect: Access denied for user 'root'@'localhost' (using > password: NO) > Either your server is not up and running or you have no > permissions for acessing the DSN DBI:mysql:test. > This test requires a running server and write permissions. > Please make sure your server is running and you have > permissions, then retry. > t/41blobs_prepare....dubious > Test returned status 10 (wstat 2560, 0xa00) > DIED. FAILED tests 1-24 > Failed 24/24 tests, 0.00% okay > t/42bindparam........DBI connect('test','',...) failed: Access denied > for user 'root'@'localhost' (using password: NO) at t/42bindparam.t > line 37 > t/42bindparam........dubious > Test returned status 255 (wstat 65280, 0xff00) > DIED. FAILED tests 1-11 > Failed 11/11 tests, 0.00% okay > t/50chopblanks.......DBI connect('test','',...) failed: Access denied > for user 'root'@'localhost' (using password: NO) at t/50chopblanks.t > line 57 > Cannot connect: Access denied for user 'root'@'localhost' (using > password: NO) > Either your server is not up and running or you have no > permissions for acessing the DSN DBI:mysql:test. > This test requires a running server and write permissions. > Please make sure your server is running and you have > permissions, then retry. > t/50chopblanks.......dubious > Test returned status 10 (wstat 2560, 0xa00) > DIED. FAILED tests 1-35 > Failed 35/35 tests, 0.00% okay > t/50commit...........DBI connect('test','',...) failed: Access denied > for user 'root'@'localhost' (using password: NO) at t/50commit.t line > 64 > Can't call method "tables" on an undefined value at t/lib.pl line 232. > t/50commit...........dubious > Test returned status 255 (wstat 65280, 0xff00) > DIED. FAILED tests 1-30 > Failed 30/30 tests, 0.00% okay > t/60leaks............skipped > all skipped: $ENV{SLOW_TESTS} is not set > t/70takeimp..........skipped > all skipped: test feature not implemented > t/75supported_sql....DBI connect('test','',...) failed: Access denied > for user 'root'@'localhost' (using password: NO) at > t/75supported_sql.t line 35 > t/75supported_sql....dubious > Test returned status 255 (wstat 65280, 0xff00) > DIED. FAILED tests 1-17 > Failed 17/17 tests, 0.00% okay > t/80procs............DBI connect('test','',...) failed: Access denied > for user 'root'@'localhost' (using password: NO) at t/80procs.t line 32 > t/80procs............dubious > Test returned status 255 (wstat 65280, 0xff00) > t/insertid...........DBI connect('test','',...) failed: Access denied > for user 'root'@'localhost' (using password: NO) at t/insertid.t line > 13 > t/insertid...........dubious > Test returned status 255 (wstat 65280, 0xff00) > DIED. FAILED tests 1-12 > Failed 12/12 tests, 0.00% okay > t/param_values.......DBI connect('test','',...) failed: Access denied > for user 'root'@'localhost' (using password: NO) at t/param_values.t > line 16 > Can't call method "tables" on an undefined value at t/lib.pl line 232. > t/param_values.......dubious > Test returned status 255 (wstat 65280, 0xff00) > DIED. FAILED tests 1-8 > Failed 8/8 tests, 0.00% okay > t/prepare_noerror....DBI connect('test','',...) failed: Access denied > for user 'root'@'localhost' (using password: NO) at > t/prepare_noerror.t line 22 > Can't call method "prepare" on an undefined value at > t/prepare_noerror.t line 25. > t/prepare_noerror....dubious > Test returned status 255 (wstat 65280, 0xff00) > t/texecute...........DBI connect('test','',...) failed: Access denied > for user 'root'@'localhost' (using password: NO) at t/texecute.t line > 17 > Can't call method "tables" on an undefined value at t/lib.pl line 232. > t/texecute...........dubious > Test returned status 255 (wstat 65280, 0xff00) > DIED. FAILED tests 1-9 > Failed 9/9 tests, 0.00% okay > t/utf8...............DBI connect('test','',...) failed: Access denied > for user 'root'@'localhost' (using password: NO) at t/utf8.t line 49 > t/utf8...............dubious > Test returned status 255 (wstat 65280, 0xff00) > Failed Test Stat Wstat Total Fail List of Failed > ----------------------------------------------------------------------- > ----------------------------------------------------------------------- > ----------------- > t/10dsnlist.t 10 2560 9 17 1-9 > t/20createdrop.t 10 2560 5 9 1-5 > t/30insertfetch.t 10 2560 11 21 1-11 > t/35limit.t 10 2560 113 225 1-113 > t/35prepare.t 255 65280 40 80 1-40 > t/40bindparam.t 255 65280 ?? ?? ?? > t/40bindparam2.t 10 2560 13 25 1-13 > t/40blobs.t 10 2560 11 21 1-11 > t/40listfields.t 10 2560 19 37 1-19 > t/40nulls.t 10 2560 11 21 1-11 > t/40numrows.t 10 2560 25 49 1-25 > t/41bindparam.t 255 65280 11 22 1-11 > t/41blobs_prepare.t 10 2560 24 47 1-24 > t/42bindparam.t 255 65280 11 22 1-11 > t/50chopblanks.t 10 2560 35 69 1-35 > t/50commit.t 255 65280 30 59 1-30 > t/75supported_sql.t 255 65280 17 34 1-17 > t/80procs.t 255 65280 ?? ?? ?? > t/insertid.t 255 65280 12 24 1-12 > t/param_values.t 255 65280 8 15 1-8 > t/prepare_noerror.t 255 65280 ?? ?? ?? > t/texecute.t 255 65280 9 17 1-9 > t/utf8.t 255 65280 ?? ?? ?? > 2 tests skipped. > Failed 23/26 test scripts. 414/419 subtests failed. > Files=26, Tests=419, 1 wallclock secs ( 1.24 cusr + 0.18 csys = > 1.42 CPU) > Failed 23/26 test programs. 414/419 subtests failed. > make: *** [test_dynamic] Error 255 > /usr/bin/make test -- NOT OK > Running make install > make test had returned bad status, won't install without force > Failed during this command: > CAPTTOFU/DBD-mysql-4.001.tar.gz : make_test NO > > > > Summary of my perl5 (revision 5 version 8 subversion 8) configuration: > Platform: > osname=linux, osvers=2.6.16, archname=i586-linux-thread-multi > uname='linux tait 2.6.16 #1 smp tue mar 14 18:04:33 utc 2006 i686 > i686 i386 gnulinux ' > config_args='-ds -e -Dprefix=/usr -Dvendorprefix=/usr - > Dinstallusrbinperl -Dusethreads -Di_db -Di_dbm -Di_ndbm -Di_gdbm - > Duseshrplib=true -Doptimize=-O2 -march=i586 -mtune=i686 -fmessage- > length=0 -Wall -D_FORTIFY_SOURCE=2 -g -Wall -pipe' > hint=recommended, useposix=true, d_sigaction=define > usethreads=define use5005threads=undef useithreads=define > usemultiplicity=define > useperlio=define d_sfio=undef uselargefiles=define usesocks=undef > use64bitint=undef use64bitall=undef uselongdouble=undef > usemymalloc=n, bincompat5005=undef > Compiler: > cc='cc', ccflags ='-D_REENTRANT -D_GNU_SOURCE -DTHREADS_HAVE_PIDS - > DDEBUGGING -fno-strict-aliasing -pipe -Wdeclaration-after-statement - > D_LARGEFILE_SOURCE -D_FILE_OFFSET_BITS=64', > optimize='-O2 -march=i586 -mtune=i686 -fmessage-length=0 -Wall - > D_FORTIFY_SOURCE=2 -g -Wall -pipe', > cppflags='-D_REENTRANT -D_GNU_SOURCE -DTHREADS_HAVE_PIDS - > DDEBUGGING -fno-strict-aliasing -pipe -Wdeclaration-after-statement' > ccversion='', gccversion='4.1.0 (SUSE Linux)', gccosandvers='' > intsize=4, longsize=4, ptrsize=4, doublesize=8, byteorder=1234 > d_longlong=define, longlongsize=8, d_longdbl=define, longdblsize=12 > ivtype='long', ivsize=4, nvtype='double', nvsize=8, Off_t='off_t', > lseeksize=8 > alignbytes=4, prototype=define > Linker and Libraries: > ld='cc', ldflags ='' > libpth=/lib /usr/lib /usr/local/lib > libs=-lnsl -ldl -lm -lcrypt -lutil -lpthread -lc > perllibs=-lnsl -ldl -lm -lcrypt -lutil -lpthread -lc > libc=/lib/libc-2.4.so, so=so, useshrplib=true, libperl=libperl.so > gnulibc_version='2.4' > Dynamic Linking: > dlsrc=dl_dlopen.xs, dlext=so, d_dlsymun=undef, ccdlflags='-Wl,-E - > Wl,-rpath,/usr/lib/perl5/5.8.8/i586-linux-thread-multi/CORE' > cccdlflags='-fPIC', lddlflags='-shared' > > > Characteristics of this binary (from libperl): > Compile-time options: DEBUGGING MULTIPLICITY PERL_IMPLICIT_CONTEXT > PERL_MALLOC_WRAP THREADS_HAVE_PIDS USE_ITHREADS > USE_LARGE_FILES USE_PERLIO USE_REENTRANT_API > Built under linux > Compiled at Apr 23 2006 00:26:41 > @INC: > /usr/lib/perl5/5.8.8/i586-linux-thread-multi > /usr/lib/perl5/5.8.8 > /usr/lib/perl5/site_perl/5.8.8/i586-linux-thread-multi > /usr/lib/perl5/site_perl/5.8.8 > /usr/lib/perl5/site_perl > /usr/lib/perl5/vendor_perl/5.8.8/i586-linux-thread-multi > /usr/lib/perl5/vendor_perl/5.8.8 > /usr/lib/perl5/vendor_perl > . > l


This service runs on Request Tracker, is sponsored by The Perl Foundation, and maintained by Best Practical Solutions.

Please report any issues with rt.cpan.org to rt-cpan-admin@bestpractical.com.