This queue is for tickets about the CPAN CPAN distribution.

Report information
The Basics
Id:
23421
Status:
resolved
Priority:
Low/Low
Queue:

People
Owner:
Nobody in particular
Requestors:
LGODDARD [...] cpan.org
Cc:
AdminCc:

BugTracker
Severity:
Unimportant
Broken in:
2.00
Fixed in:
(no value)



Subject: Attempts to modify read-onlyvalue
t\52_test_report_unknown....ok 5/22# Undefined subroutine &CPAN::Reporter::test called at t/Helper.pm line 97. # # # STDOUT: # # # STDERR: # # Failed test (t\52_test_report_unknown.t at line 59) # Failed test (t\52_test_report_unknown.t at line 59) # Failed test (t\52_test_report_unknown.t at line 59) # 'Writing Makefile for Bogus::Module # ' # doesn't match '/No tests provided/' # STDOUT: # Writing Makefile for Bogus::Module # # # STDERR: # t\52_test_report_unknown....ok 14/22# Undefined subroutine &CPAN::Reporter::test called at t/Helper.pm line 97. # # # STDOUT: # # # STDERR: # # Failed test (t\52_test_report_unknown.t at line 59) t\52_test_report_unknown....NOK 16# Failed test (t\52_test_report_unknown.t at line 59) t\52_test_report_unknown....NOK 17# Failed test (t\52_test_report_unknown.t at line 59) t\52_test_report_unknown....NOK 18# 'Writing Makefile for Bogus::Module # ' # doesn't match '/No tests were run/' # STDOUT: # Writing Makefile for Bogus::Module # # # STDERR: # t\52_test_report_unknown....ok 22/22# Looks like you failed 7 tests of 22. t\52_test_report_unknown....dubious Test returned status 7 (wstat 1792, 0x700) DIED. FAILED tests 1, 7-9, 16-18 Failed 7/22 tests, 68.18% okay (less 8 skipped tests: 7 okay, 31.82%) t\53_test_report_na.........# Failed test (t\53_test_report_na.t at line 87) # Tried to require 'CPAN::Reporter'. # Error: Can't locate Tee.pm in @INC (@INC contains: C:/.cpan/build/CPAN-Reporter-0.35/blib/arch C:/.cpan/build/CPA N-Reporter-0.35/blib/lib C:\Perl561\lib C:/Perl561/lib C:/Perl561/site/lib . C:/Perl561/lib C:/Perl561/site/lib .) at C: /.cpan/build/CPAN-Reporter-0.35/blib/lib/CPAN/Reporter.pm line 14. # BEGIN failed--compilation aborted at C:/.cpan/build/CPAN-Reporter- 0.35/blib/lib/CPAN/Reporter.pm line 14. # Compilation failed in require at (eval 6) line 2. t\53_test_report_na.........ok 5/58# Undefined subroutine &CPAN::Reporter::test called at t/Helper.pm line 97. # # # STDOUT: # # # STDERR: # t\53_test_report_na.........ok 6/58# Failed test (t\53_test_report_na.t at line 99) t\53_test_report_na.........ok 7/58# Failed test (t\53_test_report_na.t at line 99) # 'Writing Makefile for Bogus::Module # ' # doesn't match '/Prerequisite missing/' t\53_test_report_na.........NOK 8# STDOUT: # Writing Makefile for Bogus::Module # # # STDERR: # Warning: prerequisite Bogus::Module::Doesnt::Exist failed to load: Can't locate Bogus/Module/Doesnt/Exist.pm in @INC ( @INC contains: C:/.cpan/build/CPAN-Reporter-0.35/blib/arch C:/.cpan/build/CPAN-Reporter-0.35/blib/lib C:\Perl561\lib C:/ Perl561/lib C:/Perl561/site/lib . C:/Perl561/lib C:/Perl561/site/lib .) at (eval 4) line 3. # t\53_test_report_na.........ok 14/58# Undefined subroutine &CPAN::Reporter::test called at t/Helper.pm line 97. # # # STDOUT: # # # STDERR: # # Failed test (t\53_test_report_na.t at line 99) t\53_test_report_na.........ok 15/58# Failed test (t\53_test_report_na.t at line 99) t\53_test_report_na.........ok 16/58# 'Writing Makefile for Bogus::Module # ' # doesn't match '/Prerequisite missing/' t\53_test_report_na.........NOK 17# STDOUT: # Writing Makefile for Bogus::Module # # # STDERR: # Warning: prerequisite Bogus::Module::Doesnt::Exist failed to load: Can't locate Bogus/Module/Doesnt/Exist.pm in @INC ( @INC contains: C:/.cpan/build/CPAN-Reporter-0.35/blib/arch C:/.cpan/build/CPAN-Reporter-0.35/blib/lib C:\Perl561\lib C:/ Perl561/lib C:/Perl561/site/lib . C:/Perl561/lib C:/Perl561/site/lib .) at (eval 4) line 3. # t\53_test_report_na.........ok 23/58# Undefined subroutine &CPAN::Reporter::test called at t/Helper.pm line 97. # # # STDOUT: # # # STDERR: # # Failed test (t\53_test_report_na.t at line 99) # Failed test (t\53_test_report_na.t at line 99) t\53_test_report_na.........NOK 26# 'Writing Makefile for Bogus::Module # ' # doesn't match '/Prerequisite version too low/' # STDOUT: # Writing Makefile for Bogus::Module # # # STDERR: # Warning: prerequisite File::Spec 99999.9 not found at C:\Perl561 \lib/ExtUtils/MakeMaker.pm line 343. # t\53_test_report_na.........ok 32/58# Undefined subroutine &CPAN::Reporter::test called at t/Helper.pm line 97. # # # STDOUT: # # # STDERR: # # Failed test (t\53_test_report_na.t at line 99) t\53_test_report_na.........ok 33/58# Failed test (t\53_test_report_na.t at line 99) t\53_test_report_na.........ok 34/58# 'Writing Makefile for Bogus::Module # ' # doesn't match '/Prerequisite version too low/' # STDOUT: # Writing Makefile for Bogus::Module # # # STDERR: # Warning: prerequisite File::Spec 99999.9 not found at C:\Perl561 \lib/ExtUtils/MakeMaker.pm line 343. # t\53_test_report_na.........ok 41/58# Undefined subroutine &CPAN::Reporter::test called at t/Helper.pm line 97. # # # STDOUT: # # # STDERR: # # Failed test (t\53_test_report_na.t at line 99) t\53_test_report_na.........ok 43/58# Failed test (t\53_test_report_na.t at line 99) # 'Writing Makefile for Bogus::Module # ' # doesn't match '/Perl version too low/' t\53_test_report_na.........NOK 44# STDOUT: # Writing Makefile for Bogus::Module # # # STDERR: # Warning: prerequisite perl failed to load: Can't locate perl.pm in @INC (@INC contains: C:/.cpan/build/CPAN-Reporter-0 .35/blib/arch C:/.cpan/build/CPAN-Reporter-0.35/blib/lib C:\Perl561 \lib C:/Perl561/lib C:/Perl561/site/lib . C:/Perl561/ lib C:/Perl561/site/lib .) at (eval 4) line 3. # t\53_test_report_na.........ok 50/58# Undefined subroutine &CPAN::Reporter::test called at t/Helper.pm line 97. # # # STDOUT: # # # STDERR: # t\53_test_report_na.........ok 51/58# Failed test (t\53_test_report_na.t at line 99) # Failed test (t\53_test_report_na.t at line 99) t\53_test_report_na.........ok 52/58# 'Writing Makefile for Bogus::Module # ' # doesn't match '/Perl version too low/' # STDOUT: # Writing Makefile for Bogus::Module # # # STDERR: # Warning: prerequisite perl failed to load: Can't locate perl.pm in @INC (@INC contains: C:/.cpan/build/CPAN-Reporter-0 .35/blib/arch C:/.cpan/build/CPAN-Reporter-0.35/blib/lib C:\Perl561 \lib C:/Perl561/lib C:/Perl561/site/lib . C:/Perl561/ lib C:/Perl561/site/lib .) at (eval 4) line 3. # t\53_test_report_na.........ok 58/58# Looks like you failed 13 tests of 58. t\53_test_report_na.........dubious Test returned status 13 (wstat 3328, 0xd00) DIED. FAILED tests 1, 8-9, 17-18, 26-27, 35-36, 44-45, 53-54 Failed 13/58 tests, 77.59% okay (less 24 skipped tests: 21 okay, 36.21%) t\54_test_report_split......# Failed test (t\54_test_report_split.t at line 54) # Tried to require 'CPAN::Reporter'. # Error: Can't locate Tee.pm in @INC (@INC contains: C:/.cpan/build/CPAN-Reporter-0.35/blib/arch C:/.cpan/build/CPA N-Reporter-0.35/blib/lib C:\Perl561\lib C:/Perl561/lib C:/Perl561/site/lib . C:/Perl561/lib C:/Perl561/site/lib .) at C: /.cpan/build/CPAN-Reporter-0.35/blib/lib/CPAN/Reporter.pm line 14. # BEGIN failed--compilation aborted at C:/.cpan/build/CPAN-Reporter- 0.35/blib/lib/CPAN/Reporter.pm line 14. # Compilation failed in require at (eval 6) line 2. t\54_test_report_split......ok 5/22# Undefined subroutine &CPAN::Reporter::test called at t/Helper.pm line 97. # # # STDOUT: # # # STDERR: # # Failed test (t\54_test_report_split.t at line 59) t\54_test_report_split......NOK 7# Failed test (t\54_test_report_split.t at line 59) t\54_test_report_split......NOK 8# Failed test (t\54_test_report_split.t at line 59) t\54_test_report_split......NOK 9# 'Writing Makefile for Bogus::Module # ' # doesn't match '/'make test' no errors/' # STDOUT: # Writing Makefile for Bogus::Module # # # STDERR: # t\54_test_report_split......ok 14/22# Undefined subroutine &CPAN::Reporter::test called at t/Helper.pm line 97. # # # STDOUT: # # # STDERR: # # Failed test (t\54_test_report_split.t at line 59) t\54_test_report_split......ok 15/22# Failed test (t\54_test_report_split.t at line 59) t\54_test_report_split......NOK 16# Failed test (t\54_test_report_split.t at line 59) t\54_test_report_split......NOK 17# 'Writing Makefile for Bogus::Module # ' # doesn't match '/'make test' no errors/' # STDOUT: # Writing Makefile for Bogus::Module # # # STDERR: # t\54_test_report_split......ok 22/22# Looks like you failed 7 tests of 22. t\54_test_report_split......dubious Test returned status 7 (wstat 1792, 0x700) DIED. FAILED tests 1, 7-9, 16-18 Failed 7/22 tests, 68.18% okay (less 8 skipped tests: 7 okay, 31.82%) t\70_darwin_move_config.....# Failed test (t\70_darwin_move_config.t at line 59) t\70_darwin_move_config.....NOK 1# Tried to require 'CPAN::Reporter'. # Error: Can't locate Tee.pm in @INC (@INC contains: C:/.cpan/build/CPAN-Reporter-0.35/blib/arch C:/.cpan/build/CPA N-Reporter-0.35/blib/lib C:\Perl561\lib C:/Perl561/lib C:/Perl561/site/lib . C:/Perl561/lib C:/Perl561/site/lib .) at C: /.cpan/build/CPAN-Reporter-0.35/blib/lib/CPAN/Reporter.pm line 14. # BEGIN failed--compilation aborted at C:/.cpan/build/CPAN-Reporter- 0.35/blib/lib/CPAN/Reporter.pm line 14. # Compilation failed in require at (eval 6) line 2. t\70_darwin_move_config.....ok 3/8# Looks like you planned 8 tests but only ran 3. # Looks like your test died just after 3. t\70_darwin_move_config.....dubious Test returned status 255 (wstat 65280, 0xff00) DIED. FAILED tests 1, 4-8 Failed 6/8 tests, 25.00% okay t\98_pod....................skipped all skipped: Skipping author tests t\99_pod_coverage...........skipped all skipped: Skipping author tests Failed Test Stat Wstat Total Fail Failed List of Failed ----------------------------------------------------------------------- -------- t\01_CPAN_Reporter.t 3 768 3 3 100.00% 1-3 t\02_config_file.t 255 65280 30 59 196.67% 1-30 t\03_validate_option.t 255 65280 8 15 187.50% 1-8 t\04_option_parsing.t 255 65280 13 25 192.31% 1-13 t\05_prompting.t 255 65280 21 41 195.24% 1-21 t\10_prereq_pm.t 255 65280 110 213 193.64% 1 5-110 t\11_env_config.t 255 65280 30 53 176.67% 1 5-30 t\12_toolchain_versions.t 255 65280 32 57 178.13% 1 5-32 t\20_report_output.t 255 65280 40 73 182.50% 1 5-40 t\50_test_report_pass.t 19 4864 58 19 32.76% 1 7-9 16-18 25-27 34- 36 43-45 52- 54 t\51_test_report_fail.t 15 3840 67 15 22.39% 1 8-9 17-18 26-27 35- 36 44-45 53- 54 62-63 t\52_test_report_unknown.t 7 1792 22 7 31.82% 1 7-9 16-18 t\53_test_report_na.t 13 3328 58 13 22.41% 1 8-9 17-18 26-27 35- 36 44-45 53- 54 t\54_test_report_split.t 7 1792 22 7 31.82% 1 7-9 16-18 t\70_darwin_move_config.t 255 65280 8 11 137.50% 1 4-8 2 tests and 92 subtests skipped. Failed 15/17 test scripts, 11.76% okay. 342/522 subtests failed, 34.48% okay. NMAKE : fatal error U1077: 'C:\WINNT\system32\cmd.exe' : return code '0xff' Stop. C:\bin\nmake.EXE test -- NOT OK Running make install make test had returned bad status, won't install without force
Show quoted text
cpan> install CPAN::Reporter
Running install for module CPAN::Reporter Running make for D/DA/DAGOLDEN/CPAN-Reporter-0.35.tar.gz Is already unwrapped into directory C:\.cpan\build\CPAN-Reporter-0.35 Has already been processed within this session Running make test ---- Unsatisfied dependencies detected during [D/DA/DAGOLDEN/CPAN- Reporter-0.35.tar.gz] ----- File::Spec ExtUtils::MakeMaker Tee Shall I follow them and prepend them to the queue of modules we are processing right now? [yes] Use of uninitialized value in chomp at C:/Perl561/lib/ExtUtils/MakeMaker.p m line 136, <STDIN> line 3. Caught SIGINT Lockfile removed. Modification of a read-only value attempted at C:/Perl561/lib/CPAN.pm line 763, <STDIN> line 3. END failed--call queue aborted, <STDIN> line 3. perl -V Microsoft Windows XP [Version 5.1.2600] (C) Copyright 1985-2001 Microsoft Corp. C:\Documents and Settings\goddal04\Desktop>perl -V Summary of my perl5 (revision 5 version 6 subversion 1) configuration: Platform: osname=MSWin32, osvers=4.0, archname=MSWin32-x86-multi-thread uname='' config_args='undef' hint=recommended, useposix=true, d_sigaction=undef usethreads=undef use5005threads=undef useithreads=define usemultiplicity=define useperlio=undef d_sfio=undef uselargefiles=undef usesocks=undef use64bitint=undef use64bitall=undef uselongdouble=undef Compiler: cc='cl', ccflags ='-nologo -O1 -MD -Zi -DNDEBUG -DWIN32 - D_CONSOLE -DNO_STRICT -DHAVE_DES_FCRYPT -DPERL_IMPLICIT_CO NTEXT -DPERL_IMPLICIT_SYS -DPERL_MSVCRT_READFIX', optimize='-O1 -MD -Zi -DNDEBUG', cppflags='-DWIN32' ccversion='', gccversion='', gccosandvers='' intsize=4, longsize=4, ptrsize=4, doublesize=8, byteorder=1234 d_longlong=undef, longlongsize=8, d_longdbl=define, longdblsize=10 ivtype='long', ivsize=4, nvtype='double', nvsize=8, Off_t='off_t', lseeksize=4 alignbytes=8, usemymalloc=n, prototype=define Linker and Libraries: ld='link', ldflags ='-nologo -nodefaultlib -debug -opt:ref,icf - libpath:"C:\Perl561\lib\CORE" -machine:x86' libpth="C:\Perl561\lib\CORE" libs= oldnames.lib kernel32.lib user32.lib gdi32.lib winspool.lib comdlg32.lib advapi32.lib shell32.lib ole32.lib oleaut32.lib netapi32.lib uuid.lib wsock32.lib mpr.lib winmm.lib version.lib odbc32.lib odbccp32.lib msvcrt.lib perllibs= oldnames.lib kernel32.lib user32.lib gdi32.lib winspool.lib comdlg32.lib advapi32.lib shell32.lib ole32. lib oleaut32.lib netapi32.lib uuid.lib wsock32.lib mpr.lib winmm.lib version.lib odbc32.lib odbccp32.lib msvcrt.lib libc=msvcrt.lib, so=dll, useshrplib=yes, libperl=perl56.lib Dynamic Linking: dlsrc=dl_win32.xs, dlext=dll, d_dlsymun=undef, ccdlflags=' ' cccdlflags=' ', lddlflags='-dll -nologo -nodefaultlib -debug - opt:ref,icf -libpath:"C:\Perl561\lib\CORE" -machine: x86' Characteristics of this binary (from libperl): Compile-time options: MULTIPLICITY USE_ITHREADS PERL_IMPLICIT_CONTEXT PERL_IMPLICIT_SYS Locally applied patches: ActivePerl Build 638 Built under MSWin32 Compiled at Apr 13 2004 19:24:21 @INC: C:/Perl561/lib C:/Perl561/site/lib . C:\Documents and Settings\goddal04\Desktop>
Sorry, I'm at a loss here. Can you retry and provide version info for CPAN.pm and even more context? Thanks!
Closing as works-for-me. Please reopen if new evidence appears. Thanks,


This service runs on Request Tracker, is sponsored by The Perl Foundation, and maintained by Best Practical Solutions.

Please report any issues with rt.cpan.org to rt-cpan-admin@bestpractical.com.