Skip Menu |
 

This queue is for tickets about the HTTP-Proxy CPAN distribution.

Report information
The Basics
Id: 19653
Status: resolved
Priority: 0/
Queue: HTTP-Proxy

People
Owner: Nobody in particular
Requestors: aaron [...] FreeBSD.org
Cc:
AdminCc:

Bug Information
Severity: Important
Broken in: 0.19
Fixed in: (no value)



Subject: Build test fails under Perl 5.8.8 and FreeBSD 5.4
Download (untitled) / with headers
text/plain 6.1k
Here's the build log: ┌─(aaron@moondance:p0)─────────────(~/BSD/p5-HTTP-Proxy/work/HTTP-Proxy-0.19)─┐ └─(18:32:%)── perl Build.PL ──(Thu,Jun01)─┘ Checking whether your kit is complete... Looks good Checking prerequisites... Looks good Creating new 'Build' script for 'HTTP-Proxy' version '0.19' ┌─(aaron@moondance:p0)─────────────(~/BSD/p5-HTTP-Proxy/work/HTTP-Proxy-0.19)─┐ └─(18:32:%)── ./Build ──(Thu,Jun01)─┘ lib/HTTP/Proxy/Engine/Legacy.pm -> blib/lib/HTTP/Proxy/Engine/Legacy.pm lib/HTTP/Proxy/BodyFilter/htmlparser.pm -> blib/lib/HTTP/Proxy/BodyFilter/htmlparser.pm lib/HTTP/Proxy/HeaderFilter.pm -> blib/lib/HTTP/Proxy/HeaderFilter.pm lib/HTTP/Proxy/BodyFilter/simple.pm -> blib/lib/HTTP/Proxy/BodyFilter/simple.pm lib/HTTP/Proxy/BodyFilter/complete.pm -> blib/lib/HTTP/Proxy/BodyFilter/complete.pm lib/HTTP/Proxy/BodyFilter.pm -> blib/lib/HTTP/Proxy/BodyFilter.pm lib/HTTP/Proxy/BodyFilter/htmltext.pm -> blib/lib/HTTP/Proxy/BodyFilter/htmltext.pm lib/HTTP/Proxy.pm -> blib/lib/HTTP/Proxy.pm lib/HTTP/Proxy/HeaderFilter/standard.pm -> blib/lib/HTTP/Proxy/HeaderFilter/standard.pm lib/HTTP/Proxy/HeaderFilter/simple.pm -> blib/lib/HTTP/Proxy/HeaderFilter/simple.pm lib/HTTP/Proxy/Engine/NoFork.pm -> blib/lib/HTTP/Proxy/Engine/NoFork.pm lib/HTTP/Proxy/Engine/ScoreBoard.pm -> blib/lib/HTTP/Proxy/Engine/ScoreBoard.pm lib/HTTP/Proxy/BodyFilter/lines.pm -> blib/lib/HTTP/Proxy/BodyFilter/lines.pm lib/HTTP/Proxy/Engine.pm -> blib/lib/HTTP/Proxy/Engine.pm lib/HTTP/Proxy/BodyFilter/tags.pm -> blib/lib/HTTP/Proxy/BodyFilter/tags.pm lib/HTTP/Proxy/BodyFilter/save.pm -> blib/lib/HTTP/Proxy/BodyFilter/save.pm Manifying blib/lib/HTTP/Proxy/Engine.pm -> blib/libdoc/HTTP::Proxy::Engine.3 Manifying blib/lib/HTTP/Proxy/Engine/ScoreBoard.pm -> blib/libdoc/HTTP::Proxy::Engine::ScoreBoard.3 Manifying blib/lib/HTTP/Proxy.pm -> blib/libdoc/HTTP::Proxy.3 Manifying blib/lib/HTTP/Proxy/BodyFilter/tags.pm -> blib/libdoc/HTTP::Proxy::BodyFilter::tags.3 Manifying blib/lib/HTTP/Proxy/BodyFilter/lines.pm -> blib/libdoc/HTTP::Proxy::BodyFilter::lines.3 Manifying blib/lib/HTTP/Proxy/BodyFilter/complete.pm -> blib/libdoc/HTTP::Proxy::BodyFilter::complete.3 Manifying blib/lib/HTTP/Proxy/BodyFilter/simple.pm -> blib/libdoc/HTTP::Proxy::BodyFilter::simple.3 Manifying blib/lib/HTTP/Proxy/HeaderFilter/simple.pm -> blib/libdoc/HTTP::Proxy::HeaderFilter::simple.3 Manifying blib/lib/HTTP/Proxy/BodyFilter/save.pm -> blib/libdoc/HTTP::Proxy::BodyFilter::save.3 Manifying blib/lib/HTTP/Proxy/BodyFilter.pm -> blib/libdoc/HTTP::Proxy::BodyFilter.3 Manifying blib/lib/HTTP/Proxy/HeaderFilter/standard.pm -> blib/libdoc/HTTP::Proxy::HeaderFilter::standard.3 Manifying blib/lib/HTTP/Proxy/HeaderFilter.pm -> blib/libdoc/HTTP::Proxy::HeaderFilter.3 Manifying blib/lib/HTTP/Proxy/Engine/NoFork.pm -> blib/libdoc/HTTP::Proxy::Engine::NoFork.3 Manifying blib/lib/HTTP/Proxy/Engine/Legacy.pm -> blib/libdoc/HTTP::Proxy::Engine::Legacy.3 Manifying blib/lib/HTTP/Proxy/BodyFilter/htmlparser.pm -> blib/libdoc/HTTP::Proxy::BodyFilter::htmlparser.3 Manifying blib/lib/HTTP/Proxy/BodyFilter/htmltext.pm -> blib/libdoc/HTTP::Proxy::BodyFilter::htmltext.3 ┌─(aaron@moondance:p0)─────────────(~/BSD/p5-HTTP-Proxy/work/HTTP-Proxy-0.19)─┐ └─(18:32:%)── ./Build test ──(Thu,Jun01)─┘ t/00basic...........ok t/01pod.............ok t/02pod-coverage....skipped all skipped: Test::Pod::Coverage 1.04 required for testing POD coverage t/05new.............ok t/10init............ok t/11log.............ok t/15accessors.......ok 1/30maxconn is deprecated, please use max_connections at t/15accessors.t line 42 maxserve is deprecated, please use max_keep_alive_requests at t/15accessors.t line 42 t/15accessors.......ok t/15deprecated......ok t/16stash...........ok t/17fstack..........ok t/18engine..........ok t/20dummy...........ok 1/10[Thu Jun 1 18:33:20 2006] (32796) ERROR: Getting request failed: [Thu Jun 1 18:33:20 2006] (32802) ERROR: Getting request failed: t/20dummy...........ok 7/10[Thu Jun 1 18:33:21 2006] (32811) ERROR: Getting request failed: t/20dummy...........ok t/20keepalive.......ok 1/22[Thu Jun 1 18:33:23 2006] (32826) ERROR: Getting request failed: t/20keepalive.......ok t/22http............[Thu Jun 1 18:33:26 2006] (32838) ERROR: Getting request failed: t/22http............ok 1/5[Thu Jun 1 18:33:27 2006] (32850) ERROR: Getting request failed: [Thu Jun 1 18:33:28 2006] (32851) ERROR: Getting request failed: t/22http............ok 3/5[Thu Jun 1 18:33:28 2006] (32852) ERROR: Getting request failed: t/22http............ok t/22transparent.....ok t/23connect.........NOK 2 # Failed test 'Read some data from the socket' # in t/23connect.t at line 45. t/23connect.........NOK 3 # Failed test 'CONNECTed to the TCP server' # in t/23connect.t at line 46. # got: '' # expected: 'SSH-1.99-OpenSSH_3.6.1p2 # ' t/23connect.........FAILED tests 2-3 Failed 2/4 tests, 50.00% okay t/23https...........skipped all skipped: Can't make this work with Crypt::SSLeay t/40push_filters....ok t/41filters.........ok t/50hopbyhop........ok t/50standard........[Thu Jun 1 18:35:41 2006] (38632) ERROR: Getting request failed: t/50standard........ok 1/13[Thu Jun 1 18:35:41 2006] (38633) ERROR: Getting request failed: [Thu Jun 1 18:35:41 2006] (38634) ERROR: Getting request failed: t/50standard........ok 9/13[Thu Jun 1 18:35:42 2006] (38638) ERROR: Getting request failed: [Thu Jun 1 18:35:42 2006] (38671) ERROR: Getting request failed: t/50standard........ok t/50via.............ok t/51simple..........ok t/51simple2.........ok t/61simple..........ok t/61simple2.........ok t/64htmltext........ok t/64lines...........ok t/64tags............ok t/66htmlparser......ok t/71rot13...........ok t/90diveintomark....ok Failed Test Stat Wstat Total Fail List of Failed ------------------------------------------------------------------------------- t/23connect.t 4 2 2-3 2 tests skipped. Failed 1/32 test scripts. 2/369 subtests failed. Files=32, Tests=369, 192 wallclock secs (22.24 cusr + 3.86 csys = 26.10 CPU)
Download (untitled) / with headers
text/plain 649b
On Thu Jun 01 20:39:54 2006, guest wrote: Show quoted text
> Here's the build log: >
The "ERROR: Getting request failed:" messages have been removed from version 0.20 (when they are expected). Show quoted text
> t/23connect.........NOK 2 > # Failed test 'Read some data from the socket' > # in t/23connect.t at line 45. > t/23connect.........NOK 3 > # Failed test 'CONNECTed to the TCP server' > # in t/23connect.t at line 46. > # got: '' > # expected: 'SSH-1.99-OpenSSH_3.6.1p2 > # ' > t/23connect.........FAILED tests 2-3 > Failed 2/4 tests, 50.00% okay
This could be a transient connection error to the test ssh server. Was this error repeatable?
Download (untitled) / with headers
text/plain 853b
On Thu Aug 17 20:00:47 2006, BOOK wrote: Show quoted text
> On Thu Jun 01 20:39:54 2006, guest wrote:
> > Here's the build log: > >
> > The "ERROR: Getting request failed:" messages have been removed > from version 0.20 (when they are expected). >
> > t/23connect.........NOK 2 > > # Failed test 'Read some data from the socket' > > # in t/23connect.t at line 45. > > t/23connect.........NOK 3 > > # Failed test 'CONNECTed to the TCP server' > > # in t/23connect.t at line 46. > > # got: '' > > # expected: 'SSH-1.99-OpenSSH_3.6.1p2 > > # ' > > t/23connect.........FAILED tests 2-3 > > Failed 2/4 tests, 50.00% okay
> > This could be a transient connection error to the test ssh server. > Was this error repeatable?
The test has been changed to not depend on an external SSH server. The fix will be shipped with version 0.22. -- BooK


This service is sponsored and maintained by Best Practical Solutions and runs on Perl.org infrastructure.

Please report any issues with rt.cpan.org to rt-cpan-admin@bestpractical.com.