Skip Menu |
 

This queue is for tickets about the Perl-MinimumVersion CPAN distribution.

Report information
The Basics
Id: 18037
Status: resolved
Priority: 0/
Queue: Perl-MinimumVersion

People
Owner: Nobody in particular
Requestors: BARBIE [...] cpan.org
Cc:
AdminCc:

Bug Information
Severity: Important
Broken in: 0.11
Fixed in: (no value)



Subject: import not exported by Exporter (5.6.1)
Download (untitled) / with headers
text/plain 4.4k
With reference to #15284, there still appears to a problem with running tests for this distribution: C:\Perl\bin\perl.exe "-MExtUtils::Command::MM" "-e" "test_harness(0, 'in c', 'blib\lib', 'blib\arch')" t/01_compile.t t/02_main.t t/01_compile....ok 1/2"import" is not exported by the Exporter module at C:\.cpa nplus\5.6.1\build\Perl-MinimumVersion-0.11\blib\lib/Perl/MinimumVersion.pm line 46 t/01_compile....NOK 2 # Failed test 'use Perl::MinimumVersion;' # in t/01_compile.t at line 29. # Tried to use 'Perl::MinimumVersion'. # Error: Can't continue after import errors at C:\.cpanplus\5.6.1\build\Per l-MinimumVersion-0.11\blib\lib/Perl/MinimumVersion.pm line 46 # BEGIN failed--compilation aborted at t/01_compile.t line 29. # Compilation failed in require at (eval 4) line 2. # BEGIN failed--compilation aborted at (eval 4) line 2. # Looks like you failed 1 test of 2. t/01_compile....dubious Test returned status 1 (wstat 256, 0x100) DIED. FAILED test 2 Failed 1/2 tests, 50.00% okay t/02_main......."import" is not exported by the Exporter module at C:\.cpanplus\ 5.6.1\build\Perl-MinimumVersion-0.11\blib\lib/Perl/MinimumVersion.pm line 46 Can't continue after import errors at C:\.cpanplus\5.6.1\build\Perl-MinimumVersi on-0.11\blib\lib/Perl/MinimumVersion.pm line 46 BEGIN failed--compilation aborted at C:\.cpanplus\5.6.1\build\Perl-MinimumVersio n-0.11\blib\lib/Perl/MinimumVersion.pm line 46. Compilation failed in require at t/02_main.t line 22. BEGIN failed--compilation aborted at t/02_main.t line 22. t/02_main.......dubious Test returned status 255 (wstat 65280, 0xff00) DIED. FAILED tests 1-46 Failed 46/46 tests, 0.00% okay Failed Test Stat Wstat Total Fail Failed List of Failed ------------------------------------------------------------------------------- t/01_compile.t 1 256 2 1 50.00% 2 t/02_main.t 255 65280 46 92 200.00% 1-46 Failed 2/2 test scripts, 0.00% okay. 47/48 subtests failed, 2.08% okay. NMAKE : fatal error U1077: 'C:\WINNT\system32\cmd.exe' : return code '0xff' Stop. Summary of my perl5 (revision 5 version 6 subversion 1) configuration: Platform: osname=MSWin32, osvers=4.0, archname=MSWin32-x86-multi-thread uname='' config_args='undef' hint=recommended, useposix=true, d_sigaction=undef usethreads=undef use5005threads=undef useithreads=define usemultiplicity=def ine useperlio=undef d_sfio=undef uselargefiles=undef usesocks=undef use64bitint=undef use64bitall=undef uselongdouble=undef Compiler: cc='cl', ccflags ='-nologo -O1 -MD -Zi -DNDEBUG -DWIN32 -D_CONSOLE -DNO_STRI CT -DHAVE_DES_FCRYPT -DPERL_IMPLICIT_CONTEXT -DPERL_IMPLICIT_SYS -DPERL_MSVCRT_ READFIX', optimize='-O1 -MD -Zi -DNDEBUG', cppflags='-DWIN32' ccversion='', gccversion='', gccosandvers='' intsize=4, longsize=4, ptrsize=4, doublesize=8, byteorder=1234 d_longlong=undef, longlongsize=8, d_longdbl=define, longdblsize=10 ivtype='long', ivsize=4, nvtype='double', nvsize=8, Off_t='off_t', lseeksize =4 alignbytes=8, usemymalloc=n, prototype=define Linker and Libraries: ld='link', ldflags ='-nologo -nodefaultlib -debug -opt:ref,icf -libpath:"C: \Perl\lib\CORE" -machine:x86' libpth="C:\Program Files\Microsoft Visual Studio\VC98\mfc\lib" "C:\Program F iles\Microsoft Visual Studio\VC98\lib" "C:\Perl\lib\CORE" libs= oldnames.lib kernel32.lib user32.lib gdi32.lib winspool.lib comdlg32 .lib advapi32.lib shell32.lib ole32.lib oleaut32.lib netapi32.lib uuid.lib wsoc k32.lib mpr.lib winmm.lib version.lib odbc32.lib odbccp32.lib msvcrt.lib perllibs= oldnames.lib kernel32.lib user32.lib gdi32.lib winspool.lib comd lg32.lib advapi32.lib shell32.lib ole32.lib oleaut32.lib netapi32.lib uuid.lib wsock32.lib mpr.lib winmm.lib version.lib odbc32.lib odbccp32.lib msvcrt.lib libc=msvcrt.lib, so=dll, useshrplib=yes, libperl=perl56.lib Dynamic Linking: dlsrc=dl_win32.xs, dlext=dll, d_dlsymun=undef, ccdlflags=' ' cccdlflags=' ', lddlflags='-dll -nologo -nodefaultlib -debug -opt:ref,icf - libpath:"C:\Perl\lib\CORE" -machine:x86' Characteristics of this binary (from libperl): Compile-time options: MULTIPLICITY USE_ITHREADS PERL_IMPLICIT_CONTEXT PERL_IMP LICIT_SYS Locally applied patches: ActivePerl Build 638 Built under MSWin32 Compiled at Apr 13 2004 19:24:21 %ENV: PERL5LIB="C:\.cpanplus\5.6.1\lib;C:\Perl\lib;C:\Perl\site\lib;" PERL5_CPANPLUS_CONFIG="c:\.cpanplus\config" @INC: C:\Perl\lib C:\Perl\site\lib C:/Perl/lib C:/Perl/site/lib


This service is sponsored and maintained by Best Practical Solutions and runs on Perl.org infrastructure.

Please report any issues with rt.cpan.org to rt-cpan-admin@bestpractical.com.