Skip Menu |
 

This queue is for tickets about the Devel-ebug-HTTP CPAN distribution.

Report information
The Basics
Id: 17988
Status: resolved
Priority: 0/
Queue: Devel-ebug-HTTP

People
Owner: Nobody in particular
Requestors: jens.gassmann [...] atomix.de
Cc:
AdminCc:

Bug Information
Severity: (no value)
Broken in: 0.29
Fixed in: (no value)



Subject: t/ebug_http fails
Download (untitled) / with headers
text/plain 6.3k
Hi, the installation and tests fails with the following error: CPAN.pm: Going to build L/LB/LBROCARD/Devel-ebug-HTTP-0.29.tar.gz /usr/bin/perl5.8.8 Build --makefile_env_macros 1 lib/Devel/ebug/HTTP/TT.pm -> blib/lib/Devel/ebug/HTTP/TT.pm lib/Devel/ebug/HTTP.pm -> blib/lib/Devel/ebug/HTTP.pm Manifying blib/script/ebug_http -> blib/bindoc/ebug_http.1 Manifying blib/lib/Devel/ebug/HTTP.pm -> blib/libdoc/Devel::ebug::HTTP.3pm /usr/bin/make -- OK Running make test /usr/bin/perl5.8.8 Build --makefile_env_macros 1 test t/ebug_http....Can't call method "request" on an undefined value at lib/Devel/ebug/HTTP.pm line 115, <GEN1> line 2. # Looks like your test died before it could output anything. FAILED before any test output arrived Failed Test Stat Wstat Total Fail Failed List of Failed ------------------------------------------------------------------------------- t/ebug_http.t ?? ?? % ?? Failed 1/1 test scripts, 0.00% okay. 24/24 subtests failed, 0.00% okay. make: *** [test] Fehler 255 /usr/bin/make test -- NOT OK Running make install make test had returned bad status, won't install without force Perl-Version: Summary of my perl5 (revision 5 version 8 subversion 8) configuration: Platform: osname=linux, osvers=2.6.15-gentoo-r3, archname=x86_64-linux uname='linux egon 2.6.15-gentoo-r3 #1 wed feb 8 00:01:04 cet 2006 x86_64 amd athlon(tm) 64 processor 3000+ authenticamd gnulinux ' config_args='-des -Darchname=x86_64-linux -Dcccdlflags=-fPIC -Dccdlflags=-rdynamic -Dcc=x86_64-pc-linux-gnu-gcc -Dprefix=/usr -Dvendorprefix=/usr -Dsiteprefix=/usr -Dlocincpth= -Doptimize=-O2 -march=k8 -pipe -fPIC -Duselargefiles -Dd_semctl_semun -Dscriptdir=/usr/bin -Dman1dir=/usr/share/man/man1 -Dman3dir=/usr/share/man/man3 -Dinstallman1dir=/usr/share/man/man1 -Dinstallman3dir=/usr/share/man/man3 -Dman1ext=1 -Dman3ext=3pm -Dinc_version_list=5.8.0 5.8.0/x86_64-linux 5.8.2 5.8.2/x86_64-linux 5.8.4 5.8.4/x86_64-linux 5.8.5 5.8.5/x86_64-linux 5.8.6 5.8.6/x86_64-linux 5.8.7 5.8.7/x86_64-linux -Dcf_by=Gentoo -Ud_csh -Di_ndbm -Ui_gdbm -Di_db -Dd_dosuid -Dusrinc=/usr/include/gentoo-multilib/amd64 -Dlibpth=/usr/local/lib64 /lib64 /usr/lib64' hint=recommended, useposix=true, d_sigaction=define usethreads=undef use5005threads=undef useithreads=undef usemultiplicity=undef useperlio=define d_sfio=undef uselargefiles=define usesocks=undef use64bitint=define use64bitall=define uselongdouble=undef usemymalloc=n, bincompat5005=undef Compiler: cc='x86_64-pc-linux-gnu-gcc', ccflags ='-fno-strict-aliasing -pipe -Wdeclaration-after-statement -D_LARGEFILE_SOURCE -D_FILE_OFFSET_BITS=64', optimize='-O2 -march=k8 -pipe -fPIC', cppflags='-fno-strict-aliasing -pipe -Wdeclaration-after-statement' ccversion='', gccversion='3.4.5 (Gentoo 3.4.5, ssp-3.4.5-1.0, pie-8.7.9)', gccosandvers='' intsize=4, longsize=8, ptrsize=8, doublesize=8, byteorder=12345678 d_longlong=define, longlongsize=8, d_longdbl=define, longdblsize=16 ivtype='long', ivsize=8, nvtype='double', nvsize=8, Off_t='off_t', lseeksize=8 alignbytes=8, prototype=define Linker and Libraries: ld='x86_64-pc-linux-gnu-gcc', ldflags =' -L/usr/local/lib64' libpth=/usr/local/lib64 /lib64 /usr/lib64 libs=-lpthread -lnsl -lndbm -lgdbm -ldb -ldl -lm -lcrypt -lutil -lc perllibs=-lpthread -lnsl -ldl -lm -lcrypt -lutil -lc libc=/lib/libc-2.3.6.so, so=so, useshrplib=false, libperl=libperl.a gnulibc_version='2.3.6' Dynamic Linking: dlsrc=dl_dlopen.xs, dlext=so, d_dlsymun=undef, ccdlflags='-rdynamic' cccdlflags='-fPIC', lddlflags='-shared -L/usr/local/lib64' Characteristics of this binary (from libperl): Compile-time options: PERL_MALLOC_WRAP USE_64_BIT_ALL USE_64_BIT_INT USE_LARGE_FILES USE_PERLIO Built under linux Compiled at Feb 10 2006 23:49:24 @INC: /etc/perl /usr/lib64/perl5/vendor_perl/5.8.8/x86_64-linux /usr/lib64/perl5/vendor_perl/5.8.8 /usr/lib64/perl5/vendor_perl/5.8.7 /usr/lib64/perl5/vendor_perl/5.8.7/x86_64-linux /usr/lib64/perl5/vendor_perl /usr/lib64/perl5/site_perl/5.8.8/x86_64-linux /usr/lib64/perl5/site_perl/5.8.8 /usr/lib64/perl5/site_perl/5.8.7 /usr/lib64/perl5/site_perl/5.8.7/x86_64-linux /usr/lib64/perl5/site_perl /usr/lib64/perl5/5.8.8/x86_64-linux /usr/lib64/perl5/5.8.8 /usr/local/lib/site_perl . OS: Portage 2.1_pre4-r1 (default-linux/amd64/2005.1, gcc-3.4.5, glibc-2.3.6-r2, 2.6.15-gentoo-r3 x86_64) ================================================================= System uname: 2.6.15-gentoo-r3 x86_64 AMD Athlon(tm) 64 Processor 3000+ Gentoo Base System version 1.12.0_pre15 dev-lang/python: 2.3.5, 2.4.2-r1 sys-apps/sandbox: 1.2.17 sys-devel/autoconf: 2.13, 2.59-r7 sys-devel/automake: 1.4_p6, 1.5, 1.6.3, 1.7.9-r1, 1.8.5-r3, 1.9.6-r1 sys-devel/binutils: 2.16.1-r1 sys-devel/libtool: 1.5.22 virtual/os-headers: 2.6.11-r3 ACCEPT_KEYWORDS="amd64 ~amd64" AUTOCLEAN="yes" CBUILD="x86_64-pc-linux-gnu" CFLAGS="-O2 -march=k8 -pipe -fPIC" CHOST="x86_64-pc-linux-gnu" CONFIG_PROTECT="/etc /usr/kde/2/share/config /usr/kde/3.5/env /usr/kde/3.5/share/config /usr/kde/3.5/shutdown /usr/kde/3/share/config /usr/lib/X11/xkb /usr/share/config /var/qmail/control" CONFIG_PROTECT_MASK="/etc/gconf /etc/terminfo /etc/env.d" CXXFLAGS="-O2 -march=k8 -pipe -fPIC" DISTDIR="/usr/portage/distfiles" FEATURES="autoconfig distlocks sandbox sfperms strict" GENTOO_MIRRORS="http://ftp.uni-erlangen.de/pub/mirrors/gentoo http://mirrors.sec.informatik.tu-darmstadt.de/gentoo/ http://gentoo.intergenia.de http://ftp.uoi.gr/mirror/OS/gentoo/ " LANG="de_DE@euro" LINGUAS="de" MAKEOPTS="-j2" PKGDIR="/usr/portage/packages" PORTAGE_TMPDIR="/var/tmp" PORTDIR="/usr/portage" PORTDIR_OVERLAY="/usr/local/portage" SYNC="rsync://rsync.europe.gentoo.org/gentoo-portage" USE="amd64 X alsa apache apache2 avi berkdb bitmap-fonts bluetooth ccache crypt cups dlloader dvb dvd dvdr eds emboss encode flash foomaticdb fortran gcj gd gif gpm gstreamer gtk2 gtkhtml hbci ieee1394 imlib jbig jikes jpeg kde kdeenablefinal lcms lzw lzw-tiff mp3 mpeg mysql ncurses network nls no-suexec nvidia ooo-kde opengl pam pdflib perl perlsuid plugin png python qt qtmt quicktime readline real sdl spell ssl tcpd tiff truetype truetype-fonts type1-fonts unicode urandom usb userlocales v4l vhosts xpm xv zlib elibc_glibc kernel_linux linguas_de userland_GNU video_cards_nvidia" Unset: ASFLAGS, CTARGET, EMERGE_DEFAULT_OPTS, LC_ALL, LDFLAGS
Subject: Re: [rt.cpan.org #17988] Resolved: t/ebug_http fails
Date: Mon, 06 Mar 2006 22:08:11 +0100
To: bug-Devel-ebug-HTTP [...] rt.cpan.org
From: Jens Gassmann <jens.gassmann [...] atomix.de>
Download (untitled) / with headers
text/plain 1.6k
Hi, sorry, the bug resists at my maschine, how could i help to resolv it? CPAN.pm: Going to build L/LB/LBROCARD/Devel-ebug-HTTP-0.29.tar.gz # running Build.PL /usr/bin/perl5.8.8 -I_build/lib Build.PL Checking whether your kit is complete... Looks good Creating new 'Build' script for 'Devel-ebug-HTTP' version '0.29' /usr/bin/perl5.8.8 Build --makefile_env_macros 1 lib/Devel/ebug/HTTP/TT.pm -> blib/lib/Devel/ebug/HTTP/TT.pm lib/Devel/ebug/HTTP.pm -> blib/lib/Devel/ebug/HTTP.pm Manifying blib/script/ebug_http -> blib/bindoc/ebug_http.1 Manifying blib/lib/Devel/ebug/HTTP.pm -> blib/libdoc/Devel::ebug::HTTP.3pm /usr/bin/make -- OK Running make test /usr/bin/perl5.8.8 Build --makefile_env_macros 1 test t/ebug_http....Can't call method "request" on an undefined value at lib/Devel/ebug/HTTP.pm line 115, <GEN1> line 2. # Looks like your test died before it could output anything. t/ebug_http....dubious Test returned status 1 (wstat 256, 0x100) DIED. FAILED tests 1-24 Failed 24/24 tests, 0.00% okay Failed Test Stat Wstat Total Fail Failed List of Failed ------------------------------------------------------------------------------- t/ebug_http.t 1 256 24 48 200.00% 1-24 Failed 1/1 test scripts, 0.00% okay. 24/24 subtests failed, 0.00% okay. make: *** [test] Fehler 1 /usr/bin/make test -- NOT OK Running make install make test had returned bad status, won't install without force via RT wrote: Show quoted text
> <URL: http://rt.cpan.org/Ticket/Display.html?id=17988 > > > According to our records, your request has been resolved. If you have any > further questions or concerns, please respond to this message.
From: rmoriz [...] cpan.org
Download (untitled) / with headers
text/plain 250b
On Mo. 06. Mär. 2006, 16:08:27, jens.gassmann@atomix.de wrote: Show quoted text
> Hi, > > sorry, the bug resists at my maschine, how could i help to resolv it? > > CPAN.pm: Going to build L/LB/LBROCARD/Devel-ebug-HTTP-0.29.tar.gz >
why not upgrade and retry?
Subject: Re: [rt.cpan.org #17988] t/ebug_http fails
Date: Mon, 10 Apr 2006 21:03:12 +0200
To: bug-Devel-ebug-HTTP [...] rt.cpan.org
From: Jens Gassmann <jens.gassmann [...] atomix.de>
Download (untitled) / with headers
text/plain 253b
Show quoted text
>> sorry, the bug resists at my maschine, how could i help to resolv it? >> >> CPAN.pm: Going to build L/LB/LBROCARD/Devel-ebug-HTTP-0.29.tar.gz >>
> > > why not upgrade and retry?
This helps, the new version was working for me! thank you! Jens


This service is sponsored and maintained by Best Practical Solutions and runs on Perl.org infrastructure.

Please report any issues with rt.cpan.org to rt-cpan-admin@bestpractical.com.