Skip Menu |
 

This queue is for tickets about the DBD-SQLite CPAN distribution.

Report information
The Basics
Id: 1690
Status: resolved
Priority: 0/
Queue: DBD-SQLite

People
Owner: Nobody in particular
Requestors: jesse [...] bestpractical.com
Cc:
AdminCc:

Bug Information
Severity: (no value)
Broken in: (no value)
Fixed in: (no value)



Date: Fri, 18 Oct 2002 03:26:25 -0400
From: Jesse Vincent <jesse [...] bestpractical.com>
To: bug-dbd-sqlite [...] rt.cpan.org
Subject: Make test failures on 5.8.0 on OSX 10.2.1
Download (untitled) / with headers
text/plain 3.5k
So, these are the test failures I was alluding to on IRC a few weeks back. I just snagged 0.21 and it's still busted :/ This ring any bells? Best, Jesse sh-2.05a# make test PERL_DL_NONLAZY=1 /usr/local/bin/perl "-MExtUtils::Command::MM" "-e" "test_harness(0, 'blib/lib', 'blib/arch')" t/*.t t/00basic..........ok t/01logon..........ok t/02cr_table.......ok t/03insert.........ok t/04select.........ok t/05tran...........ok t/06error..........ok t/10dsnlist........ok t/20createdrop.....ok t/30insertfetch....ok t/40bindparam......FAILED test 25 Failed 1/28 tests, 96.43% okay t/40blobs..........FAILED test 8 Failed 1/11 tests, 90.91% okay t/40listfields.....ok t/40nulls..........ok t/40numrows........ok t/50chopblanks.....ok t/50commit.........ok t/99cleanup........ok t/ak-dbd...........ok t/dbdadmin.........ok Failed Test Stat Wstat Total Fail Failed List of Failed ------------------------------------------------------------------------------- t/40bindparam.t 28 1 3.57% 25 t/40blobs.t 11 1 9.09% 8 Failed 2/20 test scripts, 90.00% okay. 2/252 subtests failed, 99.21% okay. make: *** [test_dynamic] Error 2 sh-2.05a# perl -V Summary of my perl5 (revision 5.0 version 8 subversion 0) configuration: Platform: osname=darwin, osvers=6.0, archname=darwin uname='darwin paladin 6.0 darwin kernel version 6.0: sat jul 27 13:18:52 pdt 2002; root:xnuxnu-344.obj~1release_ppc power macintosh powerpc ' config_args='-ds -e -Dprefix=/opt/perl-5.8.0/' hint=previous, useposix=true, d_sigaction=define usethreads=undef use5005threads=undef useithreads=undef usemultiplicity=undef useperlio=define d_sfio=undef uselargefiles=define usesocks=undef use64bitint=undef use64bitall=undef uselongdouble=undef usemymalloc=n, bincompat5005=undef Compiler: cc='cc', ccflags ='-pipe -fno-common -no-cpp-precomp -fno-strict-aliasing -I/usr/local/include', optimize='-O3', cppflags='-no-cpp-precomp -pipe -fno-common -no-cpp-precomp -fno-strict-aliasing -I/usr/local/include -pipe -fno-common -no-cpp-precomp -fno-strict-aliasing -I/usr/local/include -pipe -fno-common -no-cpp-precomp -fno-strict-aliasing -I/usr/local/include' ccversion='', gccversion='3.1 20020420 (prerelease)', gccosandvers='' intsize=4, longsize=4, ptrsize=4, doublesize=8, byteorder=4321 d_longlong=define, longlongsize=8, d_longdbl=define, longdblsize=8 ivtype='long', ivsize=4, nvtype='double', nvsize=8, Off_t='off_t', lseeksize=8 alignbytes=8, prototype=define Linker and Libraries: ld='cc', ldflags =' -flat_namespace -L/usr/local/lib' libpth=/usr/local/lib /usr/lib libs=-lm -lc perllibs=-lm -lc libc=/usr/lib/libc.dylib, so=dylib, useshrplib=true, libperl=libperl.dylib gnulibc_version='' Dynamic Linking: dlsrc=dl_dyld.xs, dlext=bundle, d_dlsymun=undef, ccdlflags=' ' cccdlflags=' ', lddlflags=' -flat_namespace -bundle -undefined suppress -L/usr/local/lib' Characteristics of this binary (from libperl): Compile-time options: USE_LARGE_FILES Built under darwin Compiled at Sep 16 2002 18:15:24 %ENV: PERL5LIB="/sw/lib/perl5:/sw/lib/perl5" PERL_BADLANG="" @INC: /sw/lib/perl5/darwin /sw/lib/perl5 /sw/lib/perl5/darwin /sw/lib/perl5 /opt/perl-5.8.0//lib/5.8.0/darwin /opt/perl-5.8.0//lib/5.8.0 /opt/perl-5.8.0//lib/site_perl/5.8.0/darwin /opt/perl-5.8.0//lib/site_perl/5.8.0 /opt/perl-5.8.0//lib/site_perl . sh-2.05a# -- »|« http://www.bestpractical.com/rt -- Trouble Ticketing. Free.
Date: Fri, 18 Oct 2002 22:47:37 +0100
Subject: Re: [cpan #1690] Make test failures on 5.8.0 on OSX 10.2.1
From: Matt Sergeant <matt [...] sergeant.org>
To: bug-DBD-SQLite [...] rt.cpan.org
RT-Send-Cc:
Download (untitled) / with headers
text/plain 185b
Yes, it's just unicode and 5.8 issues (changes since 5.6.1). I have yet to get around to fixing the problem, but I think it's just a problem with the test, not with the code itself.
Fixed in 0.23


This service is sponsored and maintained by Best Practical Solutions and runs on Perl.org infrastructure.

Please report any issues with rt.cpan.org to rt-cpan-admin@bestpractical.com.