Skip Menu |
 

This queue is for tickets about the HTML-Parser CPAN distribution.

Report information
The Basics
Id: 14538
Status: rejected
Priority: 0/
Queue: HTML-Parser

People
Owner: Nobody in particular
Requestors: njh [...] bandsman.co.uk
Cc:
AdminCc:

Bug Information
Severity: Important
Broken in: 3.45
Fixed in: (no value)



Subject: Fails to install on MACOS/X
Download (untitled) / with headers
text/plain 4.3k
[snip] Running make test PERL_DL_NONLAZY=1 /usr/bin/perl "-MExtUtils::Command::MM" "-e" "test_harness(0, 'blib/lib', 'blib/arch')" t/*.t t/api_version........ok t/argspec-bad........ok t/argspec............ok t/argspec2...........ok t/attr-encoded.......ok t/callback...........ok t/case-sensitive.....ok t/cases..............ok t/comment............ok t/crashme............ok t/declaration........ok t/default............ok t/dtext..............ok t/entities...........ok t/entities2..........ok t/filter-methods.....ok t/filter.............ok t/handler-eof........ok t/handler............ok t/headparser-http....FAILED before any test output arrived t/headparser........./\x{FEFF}/: Can't use \x{} without 'use utf8' declaration at /private/var/root/.cpan/build/HTML-Parser-3.45/blib/lib/HTML/HeadParser.pm line 211. Compilation failed in require at t/headparser.t line 84. t/headparser.........dubious Test returned status 255 (wstat 65280, 0xff00) DIED. FAILED tests 1-6 Failed 6/6 tests, 0.00% okay t/ignore.............ok t/largetags..........ok t/linkextor-base.....ok t/linkextor-rel......ok t/magic..............ok t/marked-sect........ok t/msie-compat........ok t/offset.............ok t/options............ok t/parsefile..........ok t/parser.............ok t/plaintext..........ok t/process............ok t/pullparser.........ok t/script.............ok t/skipped-text.......ok t/stack-realloc......ok t/textarea...........ok t/tokeparser.........ok t/uentities..........skipped all skipped: This perl does not support Unicode t/unbroken-text......ok t/unicode-bom........skipped all skipped: This perl does not support Unicode t/unicode............skipped all skipped: This perl does not support Unicode t/xml-mode...........ok Failed Test Stat Wstat Total Fail Failed List of Failed ------------------------------------------------------------------------------- t/headparser-http.t ?? ?? % ?? t/headparser.t 255 65280 6 12 200.00% 1-6 3 tests skipped. Failed 2/45 test scripts, 95.56% okay. 6/242 subtests failed, 97.52% okay. make: *** [test_dynamic] Error 35 /usr/bin/make test -- NOT OK Running make install make test had returned bad status, won't install without force Show quoted text
cpan>
What version of perl is this? Please provide the output of 'perl -V'.
Fail to reproduce and 10.1 is pretty old by now.


This service is sponsored and maintained by Best Practical Solutions and runs on Perl.org infrastructure.

Please report any issues with rt.cpan.org to rt-cpan-admin@bestpractical.com.