Skip Menu |
 

This queue is for tickets about the MasonX-Request-WithApacheSession CPAN distribution.

Report information
The Basics
Id: 14476
Status: rejected
Priority: 0/
Queue: MasonX-Request-WithApacheSession

People
Owner: Nobody in particular
Requestors: eloy [...] debian.org
Cc:
AdminCc:

Bug Information
Severity: Normal
Broken in: 0.30
Fixed in: (no value)



Subject: Failed 2/3 test scripts
Download (untitled) / with headers
text/plain 1.2k
http://bugs.debian.org/cgi-bin/bugreport.cgi?bug=326456 After installing File::Find::Rule we still have: t/01-basic....NOK 11 # Failed test (/usr/share/perl5/HTML/Mason/Tests.pm at line 559) # Looks like you failed 1 test of 12. t/01-basic....dubious Test returned status 1 (wstat 256, 0x100) DIED. FAILED test 11 Failed 1/12 tests, 91.67% okay t/03-multi....NOK 4 # Failed test (/usr/share/perl5/HTML/Mason/Tests.pm at line 559) # Looks like you failed 1 test of 7. t/03-multi....dubious Test returned status 1 (wstat 256, 0x100) DIED. FAILED test 4 Failed 1/7 tests, 85.71% okay t/99-pod......ok Failed Test Stat Wstat Total Fail Failed List of Failed ------------------------------------------------------------------------------- t/01-basic.t 1 256 12 1 8.33% 11 t/03-multi.t 1 256 7 1 14.29% 4 Failed 2/3 test scripts, 33.33% okay. 2/21 subtests failed, 90.48% okay. make: *** [test] Błąd 255 HTML::Mason version 1.30
Download (untitled) / with headers
text/plain 160b
This is a duplicate of http://rt.cpan.org/Ticket/Display.html?id=19587 which has more details as to the tests failing. This appears to be a subrequest problem.


This service is sponsored and maintained by Best Practical Solutions and runs on Perl.org infrastructure.

Please report any issues with rt.cpan.org to rt-cpan-admin@bestpractical.com.