Skip Menu |
 

This queue is for tickets about the Filter-Simple CPAN distribution.

Report information
The Basics
Id: 13055
Status: resolved
Priority: 0/
Queue: Filter-Simple

People
Owner: Nobody in particular
Requestors: jdhedden [...] 1979.usna.com
Cc:
AdminCc:

Bug Information
Severity: Important
Broken in: (no value)
Fixed in: (no value)



Subject: 'make test' broken in v0.80
'make test' fails completely: /usr/local/bin/perl.exe "-MExtUtils::Command::MM" "-e" "test_harness(0, 'blib/lib', 'blib/arch')" t/*.t t/data...........Can't locate FilterOnlyTest.pm in @INC (@INC contains: /admin/cpan/build/Filter-Simple-0.80/blib/lib /admin/cpan/build/Filter-Simple-0.80/blib/arch /usr/local/lib/perl5/5.8/cygwin /usr/local/lib/perl5/5.8 /usr/local/lib/perl5/site_perl/5.8/cygwin /usr/local/lib/perl5/site_perl/5.8 /usr/local/lib/perl5/vendor_perl/5.8/cygwin /usr/local/lib/perl5/vendor_perl/5.8 . /usr/local/lib/perl5/5.8/cygwin /usr/local/lib/perl5/5.8 /usr/local/lib/perl5/site_perl/5.8/cygwin /usr/local/lib/perl5/site_perl/5.8 /usr/local/lib/perl5/site_perl/5.8 /usr/local/lib/perl5/vendor_perl/5.8/cygwin /usr/local/lib/perl5/vendor_perl/5.8 /usr/local/lib/perl5/vendor_perl/5.8 .) at t/data.t line 8. BEGIN failed--compilation aborted at t/data.t line 8. t/data...........dubious Test returned status 2 (wstat 512, 0x200) t/export.........Can't locate ExportTest.pm in @INC (@INC contains: /admin/cpan/build/Filter-Simple-0.80/blib/lib /admin/cpan/build/Filter-Simple-0.80/blib/arch /usr/local/lib/perl5/5.8/cygwin /usr/local/lib/perl5/5.8 /usr/local/lib/perl5/site_perl/5.8/cygwin /usr/local/lib/perl5/site_perl/5.8 /usr/local/lib/perl5/vendor_perl/5.8/cygwin /usr/local/lib/perl5/vendor_perl/5.8 . /usr/local/lib/perl5/5.8/cygwin /usr/local/lib/perl5/5.8 /usr/local/lib/perl5/site_perl/5.8/cygwin /usr/local/lib/perl5/site_perl/5.8 /usr/local/lib/perl5/site_perl/5.8 /usr/local/lib/perl5/vendor_perl/5.8/cygwin /usr/local/lib/perl5/vendor_perl/5.8 /usr/local/lib/perl5/vendor_perl/5.8 .) at t/export.t line 10. BEGIN failed--compilation aborted at t/export.t line 10. t/export.........dubious Test returned status 2 (wstat 512, 0x200) DIED. FAILED test 1 Failed 1/1 tests, 0.00% okay t/filter.........Can't locate FilterTest.pm in @INC (@INC contains: /admin/cpan/build/Filter-Simple-0.80/blib/lib /admin/cpan/build/Filter-Simple-0.80/blib/arch /usr/local/lib/perl5/5.8/cygwin /usr/local/lib/perl5/5.8 /usr/local/lib/perl5/site_perl/5.8/cygwin /usr/local/lib/perl5/site_perl/5.8 /usr/local/lib/perl5/vendor_perl/5.8/cygwin /usr/local/lib/perl5/vendor_perl/5.8 . /usr/local/lib/perl5/5.8/cygwin /usr/local/lib/perl5/5.8 /usr/local/lib/perl5/site_perl/5.8/cygwin /usr/local/lib/perl5/site_perl/5.8 /usr/local/lib/perl5/site_perl/5.8 /usr/local/lib/perl5/vendor_perl/5.8/cygwin /usr/local/lib/perl5/vendor_perl/5.8 /usr/local/lib/perl5/vendor_perl/5.8 .) at t/filter.t line 8. BEGIN failed--compilation aborted at t/filter.t line 8. t/filter.........dubious Test returned status 2 (wstat 512, 0x200) t/filter_only....Can't locate FilterOnlyTest.pm in @INC (@INC contains: /admin/cpan/build/Filter-Simple-0.80/blib/lib /admin/cpan/build/Filter-Simple-0.80/blib/arch /usr/local/lib/perl5/5.8/cygwin /usr/local/lib/perl5/5.8 /usr/local/lib/perl5/site_perl/5.8/cygwin /usr/local/lib/perl5/site_perl/5.8 /usr/local/lib/perl5/vendor_perl/5.8/cygwin /usr/local/lib/perl5/vendor_perl/5.8 . /usr/local/lib/perl5/5.8/cygwin /usr/local/lib/perl5/5.8 /usr/local/lib/perl5/site_perl/5.8/cygwin /usr/local/lib/perl5/site_perl/5.8 /usr/local/lib/perl5/site_perl/5.8 /usr/local/lib/perl5/vendor_perl/5.8/cygwin /usr/local/lib/perl5/vendor_perl/5.8 /usr/local/lib/perl5/vendor_perl/5.8 .) at t/filter_only.t line 8. BEGIN failed--compilation aborted at t/filter_only.t line 8. t/filter_only....dubious Test returned status 2 (wstat 512, 0x200) t/import.........Can't locate ImportTest.pm in @INC (@INC contains: /admin/cpan/build/Filter-Simple-0.80/blib/lib /admin/cpan/build/Filter-Simple-0.80/blib/arch /usr/local/lib/perl5/5.8/cygwin /usr/local/lib/perl5/5.8 /usr/local/lib/perl5/site_perl/5.8/cygwin /usr/local/lib/perl5/site_perl/5.8 /usr/local/lib/perl5/vendor_perl/5.8/cygwin /usr/local/lib/perl5/vendor_perl/5.8 . /usr/local/lib/perl5/5.8/cygwin /usr/local/lib/perl5/5.8 /usr/local/lib/perl5/site_perl/5.8/cygwin /usr/local/lib/perl5/site_perl/5.8 /usr/local/lib/perl5/site_perl/5.8 /usr/local/lib/perl5/vendor_perl/5.8/cygwin /usr/local/lib/perl5/vendor_perl/5.8 /usr/local/lib/perl5/vendor_perl/5.8 .) at t/import.t line 10. BEGIN failed--compilation aborted at t/import.t line 10. t/import.........dubious Test returned status 2 (wstat 512, 0x200) DIED. FAILED tests 1-4 Failed 4/4 tests, 0.00% okay Failed Test Stat Wstat Total Fail Failed List of Failed ------------------------------------------------------------------------------- t/data.t 2 512 ?? ?? % ?? t/export.t 2 512 1 2 200.00% 1 t/filter.t 2 512 ?? ?? % ?? t/filter_only.t 2 512 ?? ?? % ?? t/import.t 2 512 4 8 200.00% 1-4 Failed 5/5 test scripts, 0.00% okay. 5/5 subtests failed, 0.00% okay. make: *** [test_dynamic] Error 2
Download (untitled) / with headers
text/plain 1.4k
On Wed Jun 01 20:27:28 2005, guest wrote: Show quoted text
> 'make test' fails completely: > > /usr/local/bin/perl.exe "-MExtUtils::Command::MM" "-e" > "test_harness(0, 'blib/lib', 'blib/arch')" t/*.t > t/data...........Can't locate FilterOnlyTest.pm in @INC (@INC > contains: /admin/cpan/build/Filter-Simple-0.80/blib/lib > /admin/cpan/build/Filter-Simple-0.80/blib/arch > /usr/local/lib/perl5/5.8/cygwin /usr/local/lib/perl5/5.8 > /usr/local/lib/perl5/site_perl/5.8/cygwin > /usr/local/lib/perl5/site_perl/5.8 > /usr/local/lib/perl5/vendor_perl/5.8/cygwin > /usr/local/lib/perl5/vendor_perl/5.8 . > /usr/local/lib/perl5/5.8/cygwin /usr/local/lib/perl5/5.8 > /usr/local/lib/perl5/site_perl/5.8/cygwin > /usr/local/lib/perl5/site_perl/5.8 > /usr/local/lib/perl5/site_perl/5.8 > /usr/local/lib/perl5/vendor_perl/5.8/cygwin > /usr/local/lib/perl5/vendor_perl/5.8 > /usr/local/lib/perl5/vendor_perl/5.8 .) at t/data.t line 8.
[...] Show quoted text
>
------------------------------------------------------------------------------- Show quoted text
> t/data.t 2 512 ?? ?? % ?? > t/export.t 2 512 1 2 200.00% 1 > t/filter.t 2 512 ?? ?? % ?? > t/filter_only.t 2 512 ?? ?? % ?? > t/import.t 2 512 4 8 200.00% 1-4 > Failed 5/5 test scripts, 0.00% okay. 5/5 subtests failed, 0.00% okay. > make: *** [test_dynamic] Error 2
I can't reproduce this with 0.83 at all. Does the problem still manifest for you?
No problem with 0.83
Thanks, Jerry, for following up on this so quickly. Closing as it seems fixed in 0.83.


This service is sponsored and maintained by Best Practical Solutions and runs on Perl.org infrastructure.

Please report any issues with rt.cpan.org to rt-cpan-admin@bestpractical.com.