Skip Menu |
 

This queue is for tickets about the Proc-ProcessTable-Colorizer CPAN distribution.

Report information
The Basics
Id: 125692
Status: resolved
Priority: 0/
Queue: Proc-ProcessTable-Colorizer

People
Owner: Nobody in particular
Requestors: SREZIC [...] cpan.org
Cc:
AdminCc:

Bug Information
Severity: (no value)
Broken in: 0.2.0
Fixed in: (no value)



Subject: Undeclared dependency Term::Size
Download (untitled) / with headers
text/plain 1.7k
The test suite fails if Term::Size is not installed: ... # Failed test 'use Proc::ProcessTable::Colorizer;' # at t/00-load.t line 10. Bailout called. Further testing stopped: # Tried to use 'Proc::ProcessTable::Colorizer'. # Error: Can't locate Term/Size.pm in @INC (you may need to install the Term::Size module) (@INC contains: /home/cpansand/.cpan/build/2018062705/Proc-ProcessTable-Colorizer-0.2.0-0/blib/lib /home/cpansand/.cpan/build/2018062705/Proc-ProcessTable-Colorizer-0.2.0-0/blib/arch /home/cpansand/.cpan/build/2018062705/Error-Helper-1.0.0-0/blib/arch /home/cpansand/.cpan/build/2018062705/Error-Helper-1.0.0-0/blib/lib /home/cpansand/.cpan/build/2018062705/Error-Helper-1.0.0-0/blib/arch /home/cpansand/.cpan/build/2018062705/Error-Helper-1.0.0-0/blib/lib /opt/perl-5.28.0t/lib/site_perl/5.28.0/x86_64-linux-thread-multi /opt/perl-5.28.0t/lib/site_perl/5.28.0 /opt/perl-5.28.0t/lib/5.28.0/x86_64-linux-thread-multi /opt/perl-5.28.0t/lib/5.28.0) at /home/cpansand/.cpan/build/2018062705/Proc-ProcessTable-Colorizer-0.2.0-0/blib/lib/Proc/ProcessTable/Colorizer.pm line 10. # BEGIN failed--compilation aborted at /home/cpansand/.cpan/build/2018062705/Proc-ProcessTable-Colorizer-0.2.0-0/blib/lib/Proc/ProcessTable/Colorizer.pm line 10. # Compilation failed in require at t/00-load.t line 10. # BEGIN failed--compilation aborted at t/00-load.t line 10. Use of uninitialized value $Proc::ProcessTable::Colorizer::VERSION in concatenation (.) or string at t/00-load.t line 13. # Testing Proc::ProcessTable::Colorizer , Perl 5.028000, /opt/perl-5.28.0t/bin/perl # Looks like you failed 1 test of 1. FAILED--Further testing stopped. Makefile:854: recipe for target 'test_dynamic' failed make: *** [test_dynamic] Error 1 ...
Download (untitled) / with headers
text/plain 1.8k
On 2018-06-27 01:54:34, SREZIC wrote: Show quoted text
> The test suite fails if Term::Size is not installed: > > ... > # Failed test 'use Proc::ProcessTable::Colorizer;' > # at t/00-load.t line 10. > Bailout called. Further testing stopped: > # Tried to use 'Proc::ProcessTable::Colorizer'. > # Error: Can't locate Term/Size.pm in @INC (you may need to > install the Term::Size module) (@INC contains: > /home/cpansand/.cpan/build/2018062705/Proc-ProcessTable-Colorizer- > 0.2.0-0/blib/lib /home/cpansand/.cpan/build/2018062705/Proc- > ProcessTable-Colorizer-0.2.0-0/blib/arch > /home/cpansand/.cpan/build/2018062705/Error-Helper-1.0.0-0/blib/arch > /home/cpansand/.cpan/build/2018062705/Error-Helper-1.0.0-0/blib/lib > /home/cpansand/.cpan/build/2018062705/Error-Helper-1.0.0-0/blib/arch > /home/cpansand/.cpan/build/2018062705/Error-Helper-1.0.0-0/blib/lib > /opt/perl-5.28.0t/lib/site_perl/5.28.0/x86_64-linux-thread-multi > /opt/perl-5.28.0t/lib/site_perl/5.28.0 /opt/perl- > 5.28.0t/lib/5.28.0/x86_64-linux-thread-multi /opt/perl- > 5.28.0t/lib/5.28.0) at /home/cpansand/.cpan/build/2018062705/Proc- > ProcessTable-Colorizer-0.2.0-0/blib/lib/Proc/ProcessTable/Colorizer.pm > line 10. > # BEGIN failed--compilation aborted at > /home/cpansand/.cpan/build/2018062705/Proc-ProcessTable-Colorizer- > 0.2.0-0/blib/lib/Proc/ProcessTable/Colorizer.pm line 10. > # Compilation failed in require at t/00-load.t line 10. > # BEGIN failed--compilation aborted at t/00-load.t line 10. > Use of uninitialized value $Proc::ProcessTable::Colorizer::VERSION in > concatenation (.) or string at t/00-load.t line 13. > # Testing Proc::ProcessTable::Colorizer , Perl 5.028000, /opt/perl- > 5.28.0t/bin/perl > # Looks like you failed 1 test of 1. > FAILED--Further testing stopped. > Makefile:854: recipe for target 'test_dynamic' failed > make: *** [test_dynamic] Error 1 > ...
Same problem with 0.2.1
On Sat Jan 05 13:13:49 2019, SREZIC wrote: Show quoted text
> On 2018-06-27 01:54:34, SREZIC wrote:
> > The test suite fails if Term::Size is not installed: > > > > ... > > # Failed test 'use Proc::ProcessTable::Colorizer;' > > # at t/00-load.t line 10. > > Bailout called. Further testing stopped: > > # Tried to use 'Proc::ProcessTable::Colorizer'. > > # Error: Can't locate Term/Size.pm in @INC (you may need to > > install the Term::Size module) (@INC contains: > > /home/cpansand/.cpan/build/2018062705/Proc-ProcessTable-Colorizer- > > 0.2.0-0/blib/lib /home/cpansand/.cpan/build/2018062705/Proc- > > ProcessTable-Colorizer-0.2.0-0/blib/arch > > /home/cpansand/.cpan/build/2018062705/Error-Helper-1.0.0-0/blib/arch > > /home/cpansand/.cpan/build/2018062705/Error-Helper-1.0.0-0/blib/lib > > /home/cpansand/.cpan/build/2018062705/Error-Helper-1.0.0-0/blib/arch > > /home/cpansand/.cpan/build/2018062705/Error-Helper-1.0.0-0/blib/lib > > /opt/perl-5.28.0t/lib/site_perl/5.28.0/x86_64-linux-thread-multi > > /opt/perl-5.28.0t/lib/site_perl/5.28.0 /opt/perl- > > 5.28.0t/lib/5.28.0/x86_64-linux-thread-multi /opt/perl- > > 5.28.0t/lib/5.28.0) at /home/cpansand/.cpan/build/2018062705/Proc- > > ProcessTable-Colorizer-0.2.0-0/blib/lib/Proc/ProcessTable/Colorizer.pm > > line 10. > > # BEGIN failed--compilation aborted at > > /home/cpansand/.cpan/build/2018062705/Proc-ProcessTable-Colorizer- > > 0.2.0-0/blib/lib/Proc/ProcessTable/Colorizer.pm line 10. > > # Compilation failed in require at t/00-load.t line 10. > > # BEGIN failed--compilation aborted at t/00-load.t line 10. > > Use of uninitialized value $Proc::ProcessTable::Colorizer::VERSION in > > concatenation (.) or string at t/00-load.t line 13. > > # Testing Proc::ProcessTable::Colorizer , Perl 5.028000, /opt/perl- > > 5.28.0t/bin/perl > > # Looks like you failed 1 test of 1. > > FAILED--Further testing stopped. > > Makefile:854: recipe for target 'test_dynamic' failed > > make: *** [test_dynamic] Error 1 > > ...
> > > Same problem with 0.2.1
Ohh! Thanks! :) Added and uploaded 0.2.2.


This service is sponsored and maintained by Best Practical Solutions and runs on Perl.org infrastructure.

Please report any issues with rt.cpan.org to rt-cpan-admin@bestpractical.com.