Skip Menu |
 

This queue is for tickets about the mod_perl CPAN distribution.

Report information
The Basics
Id: 111626
Status: new
Priority: 0/
Queue: mod_perl

People
Owner: Nobody in particular
Requestors: justineuro [...] gmail.com
Cc:
AdminCc:

Bug Information
Severity: (no value)
Broken in: (no value)
Fixed in: (no value)



Subject: Bug: mod_perl-2.0.9; Use of uninitialized value $proto in socket
Date: Mon, 1 Feb 2016 13:21:00 +0000
To: bug-Mod_perl [...] rt.cpan.org
From: Justine Leon Uro <justineuro [...] gmail.com>
Download (untitled) / with headers
text/plain 3.7k
Tail part of make -k output: ... make[2]: Leaving directory '/home/juro/Documents/WeBWorK/mod_perl-2.0.9/xs/ModPerl' make[1]: Leaving directory '/home/juro/Documents/WeBWorK/mod_perl-2.0.9/xs' "/usr/local/bin/perl" -Iblib/arch -Iblib/lib \ t/TEST -clean [warning] setting ulimit to allow core files ulimit -c unlimited; /usr/local/bin/perl /home/juro/Documents/WeBWorK/mod_perl-2.0.9/t/TEST -clean Use of uninitialized value $proto in socket at /home/juro/Documents/WeBWorK/mod_perl-2.0.9/Apache-Test/lib/Apache/TestServer.pm line 383. Makefile:1128: recipe for target 'test_clean' failed make: *** [test_clean] Error 2 cd ModPerl-Registry && make test make[1]: Entering directory '/home/juro/Documents/WeBWorK/mod_perl-2.0.9/ModPerl-Registry' "/usr/local/bin/perl" -I../blib/arch -I../blib/lib \ t/TEST -clean [warning] setting ulimit to allow core files ulimit -c unlimited; /usr/local/bin/perl /home/juro/Documents/WeBWorK/mod_perl-2.0.9/ModPerl-Registry/t/TEST -clean Use of uninitialized value $proto in socket at /home/juro/Documents/WeBWorK/mod_perl-2.0.9/ModPerl-Registry/t/../../Apache-Test/lib/Apache/TestServer.pm line 383. Makefile:636: recipe for target 'test_clean' failed make[1]: *** [test_clean] Error 2 APACHE_TEST_APXS= APACHE_TEST_GROUP= APACHE_TEST_HTTPD= APACHE_TEST_PORT= APACHE_TEST_USER= \ "/usr/local/bin/perl" -I../blib/arch -I../blib/lib \ t/TEST -bugreport -verbose=0 [warning] setting ulimit to allow core files ulimit -c unlimited; /usr/local/bin/perl /home/juro/Documents/WeBWorK/mod_perl-2.0.9/ModPerl-Registry/t/TEST -bugreport -verbose=0 Use of uninitialized value $proto in socket at /home/juro/Documents/WeBWorK/mod_perl-2.0.9/ModPerl-Registry/t/../../Apache-Test/lib/Apache/TestServer.pm line 383. +--------------------------------------------------------+ | Please file a bug report: http://perl.apache.org/bugs/ | +--------------------------------------------------------+ Makefile:640: recipe for target 'run_tests' failed make[1]: *** [run_tests] Error 2 make[1]: Target 'test' not remade because of errors. make[1]: Leaving directory '/home/juro/Documents/WeBWorK/mod_perl-2.0.9/ModPerl-Registry' Makefile:1137: recipe for target 'run_subtests' failed make: *** [run_subtests] Error 2 cd Apache-Reload && make test make[1]: Entering directory '/home/juro/Documents/WeBWorK/mod_perl-2.0.9/Apache-Reload' "/usr/local/bin/perl" -I../blib/arch -I../blib/lib \ t/TEST -clean [warning] setting ulimit to allow core files ulimit -c unlimited; /usr/local/bin/perl /home/juro/Documents/WeBWorK/mod_perl-2.0.9/Apache-Reload/t/TEST -clean Use of uninitialized value $proto in socket at /home/juro/Documents/WeBWorK/mod_perl-2.0.9/Apache-Test/lib/Apache/TestServer.pm line 383. Makefile:627: recipe for target 'test_clean' failed make[1]: *** [test_clean] Error 2 APACHE_TEST_APXS= APACHE_TEST_GROUP= APACHE_TEST_HTTPD= APACHE_TEST_PORT= APACHE_TEST_USER= \ "/usr/local/bin/perl" -I../blib/arch -I../blib/lib \ t/TEST -bugreport -verbose=0 [warning] setting ulimit to allow core files ulimit -c unlimited; /usr/local/bin/perl /home/juro/Documents/WeBWorK/mod_perl-2.0.9/Apache-Reload/t/TEST -bugreport -verbose=0 Use of uninitialized value $proto in socket at /home/juro/Documents/WeBWorK/mod_perl-2.0.9/Apache-Test/lib/Apache/TestServer.pm line 383. Makefile:631: recipe for target 'run_tests' failed make[1]: *** [run_tests] Error 2 make[1]: Target 'test' not remade because of errors. make[1]: Leaving directory '/home/juro/Documents/WeBWorK/mod_perl-2.0.9/Apache-Reload' Makefile:1140: recipe for target 'run_subtests' failed make: *** [run_subtests] Error 2 make: Target 'test' not remade because of errors. -- justine leon ----------------------------------------------------------- Justine Leon A. Uro B15 L16 New Capitol Estates I Commonwealth Avenue 1121 Quezon City PHILIPPINES Tel. No. : (63)(02) 931-2151 (Res)


This service is sponsored and maintained by Best Practical Solutions and runs on Perl.org infrastructure.

Please report any issues with rt.cpan.org to rt-cpan-admin@bestpractical.com.