Skip Menu |
 

This queue is for tickets about the Tk CPAN distribution.

Report information
The Basics
Id: 100283
Status: open
Priority: 0/
Queue: Tk

People
Owner: Nobody in particular
Requestors: Kevin.Geng [...] imgtec.com
Cc:
AdminCc:

Bug Information
Severity: (no value)
Broken in: (no value)
Fixed in: (no value)



Subject: Bug about Tk
Date: Wed, 12 Nov 2014 06:07:00 +0000
To: "bug-Tk [...] rt.cpan.org" <bug-Tk [...] rt.cpan.org>
From: Kevin Geng <Kevin.Geng [...] imgtec.com>
Download (untitled) / with headers
text/plain 500b
Hi, When I install Tk in linux platform, I found the following error when execute "make test": 17464da0 is not a hash at /usr/lib64/perl5/site_perl/5.8.8/x86_64-linux-thread-multi/Tk/MainWindow.pm line 53. Abort Line 53 in MainWindow.pm is: my $top = eval { bless Create($package->CreateArgs(\%args)), $package }; After the installation, When I running perl script which use Tk. It still report the above error message. Could you please help to debug this bug and how to fix it? Thanks Kevin
Download (untitled) / with headers
text/plain 723b
On 2014-11-12 01:07:22, Kevin.Geng@imgtec.com wrote: Show quoted text
> Hi, > > When I install Tk in linux platform, I found the following error when > execute "make test": > > > 17464da0 is not a hash at /usr/lib64/perl5/site_perl/5.8.8/x86_64- > linux-thread-multi/Tk/MainWindow.pm line 53. > > Abort > > Line 53 in MainWindow.pm is: > my $top = eval { bless Create($package->CreateArgs(\%args)), $package > }; > > After the installation, When I running perl script which use Tk. > It still report the above error message. > > Could you please help to debug this bug and how to fix it?
Can you send me the log of "make test" and tell me the exact linux distribution you're using, along with the perl version? Regards, Slaven
Subject: RE: [rt.cpan.org #100283] Bug about Tk
Date: Wed, 12 Nov 2014 09:12:05 +0000
To: "bug-Tk [...] rt.cpan.org" <bug-Tk [...] rt.cpan.org>
From: Kevin Geng <Kevin.Geng [...] imgtec.com>
Download (untitled) / with headers
text/plain 7.6k
Hi Slaven, Thanks you so much for your quick response and kindly help! The perl version is: 5.8.8/x86_64-linux-thread-multi The linux distribution is : 2.6.18-274.12.1.el5 Distributor ID: CentOS Description: CentOS release 5.7 (Final) The log of "make test" is: --- cd pTk && make DEFINE="" LIBPERL_A="libperl.a" LINKTYPE="dynamic" OPTIMIZE="-O2 -g -pipe -Wall -Wp,-D_FORTIFY_SOURCE=2 -fexceptions -fstack-protector --param=ssp-buffer-size=4 -m64 -mtune=generic" PREFIX="/usr" PASTHRU_DEFINE="" PASTHRU_INC="" make[1]: Entering directory `/home/hxgeng/hxgeng/my_script/perl_xml/testing/tk/Tk-804.032/pTk' make[1]: Leaving directory `/home/hxgeng/hxgeng/my_script/perl_xml/testing/tk/Tk-804.032/pTk' make[1]: Entering directory `/home/hxgeng/hxgeng/my_script/perl_xml/testing/tk/Tk-804.032/pTk' make[1]: Leaving directory `/home/hxgeng/hxgeng/my_script/perl_xml/testing/tk/Tk-804.032/pTk' make[1]: Entering directory `/home/hxgeng/hxgeng/my_script/perl_xml/testing/tk/Tk-804.032/pod' Manifying 101 pod documents make[1]: Leaving directory `/home/hxgeng/hxgeng/my_script/perl_xml/testing/tk/Tk-804.032/pod' make[1]: Entering directory `/home/hxgeng/hxgeng/my_script/perl_xml/testing/tk/Tk-804.032/demos' Manifying 1 pod document Manifying 2 pod documents make[1]: Leaving directory `/home/hxgeng/hxgeng/my_script/perl_xml/testing/tk/Tk-804.032/demos' make[1]: Entering directory `/home/hxgeng/hxgeng/my_script/perl_xml/testing/tk/Tk-804.032/Xlib' make[2]: Entering directory `/home/hxgeng/hxgeng/my_script/perl_xml/testing/tk/Tk-804.032/Xlib/X' make[2]: Leaving directory `/home/hxgeng/hxgeng/my_script/perl_xml/testing/tk/Tk-804.032/Xlib/X' make[1]: Leaving directory `/home/hxgeng/hxgeng/my_script/perl_xml/testing/tk/Tk-804.032/Xlib' make[1]: Entering directory `/home/hxgeng/hxgeng/my_script/perl_xml/testing/tk/Tk-804.032/WinPhoto' Manifying 1 pod document make[1]: Leaving directory `/home/hxgeng/hxgeng/my_script/perl_xml/testing/tk/Tk-804.032/WinPhoto' make[1]: Entering directory `/home/hxgeng/hxgeng/my_script/perl_xml/testing/tk/Tk-804.032/Tixish' make[1]: Leaving directory `/home/hxgeng/hxgeng/my_script/perl_xml/testing/tk/Tk-804.032/Tixish' make[1]: Entering directory `/home/hxgeng/hxgeng/my_script/perl_xml/testing/tk/Tk-804.032/TixPixmap' make[1]: Leaving directory `/home/hxgeng/hxgeng/my_script/perl_xml/testing/tk/Tk-804.032/TixPixmap' make[1]: Entering directory `/home/hxgeng/hxgeng/my_script/perl_xml/testing/tk/Tk-804.032/TixGrid' make[1]: Leaving directory `/home/hxgeng/hxgeng/my_script/perl_xml/testing/tk/Tk-804.032/TixGrid' make[1]: Entering directory `/home/hxgeng/hxgeng/my_script/perl_xml/testing/tk/Tk-804.032/TextList' Manifying 1 pod document make[1]: Leaving directory `/home/hxgeng/hxgeng/my_script/perl_xml/testing/tk/Tk-804.032/TextList' make[1]: Entering directory `/home/hxgeng/hxgeng/my_script/perl_xml/testing/tk/Tk-804.032/Text' make[1]: Leaving directory `/home/hxgeng/hxgeng/my_script/perl_xml/testing/tk/Tk-804.032/Text' make[1]: Entering directory `/home/hxgeng/hxgeng/my_script/perl_xml/testing/tk/Tk-804.032/TList' make[1]: Leaving directory `/home/hxgeng/hxgeng/my_script/perl_xml/testing/tk/Tk-804.032/TList' make[1]: Entering directory `/home/hxgeng/hxgeng/my_script/perl_xml/testing/tk/Tk-804.032/Scrollbar' make[1]: Leaving directory `/home/hxgeng/hxgeng/my_script/perl_xml/testing/tk/Tk-804.032/Scrollbar' make[1]: Entering directory `/home/hxgeng/hxgeng/my_script/perl_xml/testing/tk/Tk-804.032/Scale' make[1]: Leaving directory `/home/hxgeng/hxgeng/my_script/perl_xml/testing/tk/Tk-804.032/Scale' make[1]: Entering directory `/home/hxgeng/hxgeng/my_script/perl_xml/testing/tk/Tk-804.032/PNG' Manifying 1 pod document make[1]: Leaving directory `/home/hxgeng/hxgeng/my_script/perl_xml/testing/tk/Tk-804.032/PNG' make[1]: Entering directory `/home/hxgeng/hxgeng/my_script/perl_xml/testing/tk/Tk-804.032/NBFrame' make[1]: Leaving directory `/home/hxgeng/hxgeng/my_script/perl_xml/testing/tk/Tk-804.032/NBFrame' make[1]: Entering directory `/home/hxgeng/hxgeng/my_script/perl_xml/testing/tk/Tk-804.032/Mwm' make[1]: Leaving directory `/home/hxgeng/hxgeng/my_script/perl_xml/testing/tk/Tk-804.032/Mwm' make[1]: Entering directory `/home/hxgeng/hxgeng/my_script/perl_xml/testing/tk/Tk-804.032/Menubutton' make[1]: Leaving directory `/home/hxgeng/hxgeng/my_script/perl_xml/testing/tk/Tk-804.032/Menubutton' make[1]: Entering directory `/home/hxgeng/hxgeng/my_script/perl_xml/testing/tk/Tk-804.032/Listbox' make[1]: Leaving directory `/home/hxgeng/hxgeng/my_script/perl_xml/testing/tk/Tk-804.032/Listbox' make[1]: Entering directory `/home/hxgeng/hxgeng/my_script/perl_xml/testing/tk/Tk-804.032/JPEG' Manifying 1 pod document Manifying 1 pod document make[1]: Leaving directory `/home/hxgeng/hxgeng/my_script/perl_xml/testing/tk/Tk-804.032/JPEG' make[1]: Entering directory `/home/hxgeng/hxgeng/my_script/perl_xml/testing/tk/Tk-804.032/InputO' make[1]: Leaving directory `/home/hxgeng/hxgeng/my_script/perl_xml/testing/tk/Tk-804.032/InputO' make[1]: Entering directory `/home/hxgeng/hxgeng/my_script/perl_xml/testing/tk/Tk-804.032/IO' make[1]: Leaving directory `/home/hxgeng/hxgeng/my_script/perl_xml/testing/tk/Tk-804.032/IO' make[1]: Entering directory `/home/hxgeng/hxgeng/my_script/perl_xml/testing/tk/Tk-804.032/HList' make[1]: Leaving directory `/home/hxgeng/hxgeng/my_script/perl_xml/testing/tk/Tk-804.032/HList' make[1]: Entering directory `/home/hxgeng/hxgeng/my_script/perl_xml/testing/tk/Tk-804.032/Event' make[1]: Leaving directory `/home/hxgeng/hxgeng/my_script/perl_xml/testing/tk/Tk-804.032/Event' make[1]: Entering directory `/home/hxgeng/hxgeng/my_script/perl_xml/testing/tk/Tk-804.032/Entry' make[1]: Leaving directory `/home/hxgeng/hxgeng/my_script/perl_xml/testing/tk/Tk-804.032/Entry' make[1]: Entering directory `/home/hxgeng/hxgeng/my_script/perl_xml/testing/tk/Tk-804.032/DragDrop' Manifying 3 pod documents make[1]: Leaving directory `/home/hxgeng/hxgeng/my_script/perl_xml/testing/tk/Tk-804.032/DragDrop' make[1]: Entering directory `/home/hxgeng/hxgeng/my_script/perl_xml/testing/tk/Tk-804.032/Compound' make[1]: Leaving directory `/home/hxgeng/hxgeng/my_script/perl_xml/testing/tk/Tk-804.032/Compound' make[1]: Entering directory `/home/hxgeng/hxgeng/my_script/perl_xml/testing/tk/Tk-804.032/Canvas' make[1]: Leaving directory `/home/hxgeng/hxgeng/my_script/perl_xml/testing/tk/Tk-804.032/Canvas' /usr/bin/perl "-It" "-MTkTest" "-e" "checked_test_harness('./xt', 0, 'blib/lib', 'blib/arch')" ba67d70 is not a hash at /home/hxgeng/hxgeng/my_script/perl_xml/testing/tk/Tk-804.032/blib/lib/Tk/MainWindow.pm line 53. make: *** [test_dynamic] Aborted Thanks Kevin Show quoted text
-----Original Message----- From: Slaven_Rezic via RT [mailto:bug-Tk@rt.cpan.org] Sent: Wednesday, November 12, 2014 2:59 PM To: Kevin Geng Subject: [rt.cpan.org #100283] Bug about Tk <URL: https://rt.cpan.org/Ticket/Display.html?id=100283 > On 2014-11-12 01:07:22, Kevin.Geng@imgtec.com wrote:
> Hi, > > When I install Tk in linux platform, I found the following error when > execute "make test": > > > 17464da0 is not a hash at /usr/lib64/perl5/site_perl/5.8.8/x86_64- > linux-thread-multi/Tk/MainWindow.pm line 53. > > Abort > > Line 53 in MainWindow.pm is: > my $top = eval { bless Create($package->CreateArgs(\%args)), $package > }; > > After the installation, When I running perl script which use Tk. > It still report the above error message. > > Could you please help to debug this bug and how to fix it?
Can you send me the log of "make test" and tell me the exact linux distribution you're using, along with the perl version? Regards, Slaven
Download (untitled) / with headers
text/plain 8.3k
On 2014-11-12 04:12:21, Kevin.Geng@imgtec.com wrote: Show quoted text
> Hi Slaven, > > Thanks you so much for your quick response and kindly help! > The perl version is: 5.8.8/x86_64-linux-thread-multi > The linux distribution is : 2.6.18-274.12.1.el5 > Distributor ID: CentOS > Description: CentOS release 5.7 (Final) > The log of "make test" is: > --- cd pTk && make DEFINE="" LIBPERL_A="libperl.a" LINKTYPE="dynamic" > OPTIMIZE="-O2 -g -pipe -Wall -Wp,-D_FORTIFY_SOURCE=2 -fexceptions > -fstack-protector > --param=ssp-buffer-size=4 -m64 -mtune=generic" PREFIX="/usr" > PASTHRU_DEFINE="" > PASTHRU_INC="" > make[1]: Entering directory > `/home/hxgeng/hxgeng/my_script/perl_xml/testing/tk/Tk-804.032/pTk' > make[1]: Leaving directory > `/home/hxgeng/hxgeng/my_script/perl_xml/testing/tk/Tk-804.032/pTk' > make[1]: Entering directory > `/home/hxgeng/hxgeng/my_script/perl_xml/testing/tk/Tk-804.032/pTk' > make[1]: Leaving directory > `/home/hxgeng/hxgeng/my_script/perl_xml/testing/tk/Tk-804.032/pTk' > make[1]: Entering directory > `/home/hxgeng/hxgeng/my_script/perl_xml/testing/tk/Tk-804.032/pod' > Manifying 101 pod documents > make[1]: Leaving directory > `/home/hxgeng/hxgeng/my_script/perl_xml/testing/tk/Tk-804.032/pod' > make[1]: Entering directory > `/home/hxgeng/hxgeng/my_script/perl_xml/testing/tk/Tk-804.032/demos' > Manifying 1 pod document > Manifying 2 pod documents > make[1]: Leaving directory > `/home/hxgeng/hxgeng/my_script/perl_xml/testing/tk/Tk-804.032/demos' > make[1]: Entering directory > `/home/hxgeng/hxgeng/my_script/perl_xml/testing/tk/Tk-804.032/Xlib' > make[2]: Entering directory > `/home/hxgeng/hxgeng/my_script/perl_xml/testing/tk/Tk-804.032/Xlib/X' > make[2]: Leaving directory > `/home/hxgeng/hxgeng/my_script/perl_xml/testing/tk/Tk-804.032/Xlib/X' > make[1]: Leaving directory > `/home/hxgeng/hxgeng/my_script/perl_xml/testing/tk/Tk-804.032/Xlib' > make[1]: Entering directory > `/home/hxgeng/hxgeng/my_script/perl_xml/testing/tk/Tk- > 804.032/WinPhoto' > Manifying 1 pod document > make[1]: Leaving directory > `/home/hxgeng/hxgeng/my_script/perl_xml/testing/tk/Tk- > 804.032/WinPhoto' > make[1]: Entering directory > `/home/hxgeng/hxgeng/my_script/perl_xml/testing/tk/Tk-804.032/Tixish' > make[1]: Leaving directory > `/home/hxgeng/hxgeng/my_script/perl_xml/testing/tk/Tk-804.032/Tixish' > make[1]: Entering directory > `/home/hxgeng/hxgeng/my_script/perl_xml/testing/tk/Tk- > 804.032/TixPixmap' > make[1]: Leaving directory > `/home/hxgeng/hxgeng/my_script/perl_xml/testing/tk/Tk- > 804.032/TixPixmap' > make[1]: Entering directory > `/home/hxgeng/hxgeng/my_script/perl_xml/testing/tk/Tk-804.032/TixGrid' > make[1]: Leaving directory > `/home/hxgeng/hxgeng/my_script/perl_xml/testing/tk/Tk-804.032/TixGrid' > make[1]: Entering directory > `/home/hxgeng/hxgeng/my_script/perl_xml/testing/tk/Tk- > 804.032/TextList' > Manifying 1 pod document > make[1]: Leaving directory > `/home/hxgeng/hxgeng/my_script/perl_xml/testing/tk/Tk- > 804.032/TextList' > make[1]: Entering directory > `/home/hxgeng/hxgeng/my_script/perl_xml/testing/tk/Tk-804.032/Text' > make[1]: Leaving directory > `/home/hxgeng/hxgeng/my_script/perl_xml/testing/tk/Tk-804.032/Text' > make[1]: Entering directory > `/home/hxgeng/hxgeng/my_script/perl_xml/testing/tk/Tk-804.032/TList' > make[1]: Leaving directory > `/home/hxgeng/hxgeng/my_script/perl_xml/testing/tk/Tk-804.032/TList' > make[1]: Entering directory > `/home/hxgeng/hxgeng/my_script/perl_xml/testing/tk/Tk- > 804.032/Scrollbar' > make[1]: Leaving directory > `/home/hxgeng/hxgeng/my_script/perl_xml/testing/tk/Tk- > 804.032/Scrollbar' > make[1]: Entering directory > `/home/hxgeng/hxgeng/my_script/perl_xml/testing/tk/Tk-804.032/Scale' > make[1]: Leaving directory > `/home/hxgeng/hxgeng/my_script/perl_xml/testing/tk/Tk-804.032/Scale' > make[1]: Entering directory > `/home/hxgeng/hxgeng/my_script/perl_xml/testing/tk/Tk-804.032/PNG' > Manifying 1 pod document > make[1]: Leaving directory > `/home/hxgeng/hxgeng/my_script/perl_xml/testing/tk/Tk-804.032/PNG' > make[1]: Entering directory > `/home/hxgeng/hxgeng/my_script/perl_xml/testing/tk/Tk-804.032/NBFrame' > make[1]: Leaving directory > `/home/hxgeng/hxgeng/my_script/perl_xml/testing/tk/Tk-804.032/NBFrame' > make[1]: Entering directory > `/home/hxgeng/hxgeng/my_script/perl_xml/testing/tk/Tk-804.032/Mwm' > make[1]: Leaving directory > `/home/hxgeng/hxgeng/my_script/perl_xml/testing/tk/Tk-804.032/Mwm' > make[1]: Entering directory > `/home/hxgeng/hxgeng/my_script/perl_xml/testing/tk/Tk- > 804.032/Menubutton' > make[1]: Leaving directory > `/home/hxgeng/hxgeng/my_script/perl_xml/testing/tk/Tk- > 804.032/Menubutton' > make[1]: Entering directory > `/home/hxgeng/hxgeng/my_script/perl_xml/testing/tk/Tk-804.032/Listbox' > make[1]: Leaving directory > `/home/hxgeng/hxgeng/my_script/perl_xml/testing/tk/Tk-804.032/Listbox' > make[1]: Entering directory > `/home/hxgeng/hxgeng/my_script/perl_xml/testing/tk/Tk-804.032/JPEG' > Manifying 1 pod document > Manifying 1 pod document > make[1]: Leaving directory > `/home/hxgeng/hxgeng/my_script/perl_xml/testing/tk/Tk-804.032/JPEG' > make[1]: Entering directory > `/home/hxgeng/hxgeng/my_script/perl_xml/testing/tk/Tk-804.032/InputO' > make[1]: Leaving directory > `/home/hxgeng/hxgeng/my_script/perl_xml/testing/tk/Tk-804.032/InputO' > make[1]: Entering directory > `/home/hxgeng/hxgeng/my_script/perl_xml/testing/tk/Tk-804.032/IO' > make[1]: Leaving directory > `/home/hxgeng/hxgeng/my_script/perl_xml/testing/tk/Tk-804.032/IO' > make[1]: Entering directory > `/home/hxgeng/hxgeng/my_script/perl_xml/testing/tk/Tk-804.032/HList' > make[1]: Leaving directory > `/home/hxgeng/hxgeng/my_script/perl_xml/testing/tk/Tk-804.032/HList' > make[1]: Entering directory > `/home/hxgeng/hxgeng/my_script/perl_xml/testing/tk/Tk-804.032/Event' > make[1]: Leaving directory > `/home/hxgeng/hxgeng/my_script/perl_xml/testing/tk/Tk-804.032/Event' > make[1]: Entering directory > `/home/hxgeng/hxgeng/my_script/perl_xml/testing/tk/Tk-804.032/Entry' > make[1]: Leaving directory > `/home/hxgeng/hxgeng/my_script/perl_xml/testing/tk/Tk-804.032/Entry' > make[1]: Entering directory > `/home/hxgeng/hxgeng/my_script/perl_xml/testing/tk/Tk- > 804.032/DragDrop' > Manifying 3 pod documents > make[1]: Leaving directory > `/home/hxgeng/hxgeng/my_script/perl_xml/testing/tk/Tk- > 804.032/DragDrop' > make[1]: Entering directory > `/home/hxgeng/hxgeng/my_script/perl_xml/testing/tk/Tk- > 804.032/Compound' > make[1]: Leaving directory > `/home/hxgeng/hxgeng/my_script/perl_xml/testing/tk/Tk- > 804.032/Compound' > make[1]: Entering directory > `/home/hxgeng/hxgeng/my_script/perl_xml/testing/tk/Tk-804.032/Canvas' > make[1]: Leaving directory > `/home/hxgeng/hxgeng/my_script/perl_xml/testing/tk/Tk-804.032/Canvas' > /usr/bin/perl "-It" "-MTkTest" "-e" "checked_test_harness('./xt', 0, > 'blib/lib', 'blib/arch')" > ba67d70 is not a hash at > /home/hxgeng/hxgeng/my_script/perl_xml/testing/tk/Tk- > 804.032/blib/lib/Tk/MainWindow.pm > line 53. > make: *** [test_dynamic] Aborted > > > Thanks > Kevin > -----Original Message----- > From: Slaven_Rezic via RT [mailto:bug-Tk@rt.cpan.org] > Sent: Wednesday, November 12, 2014 2:59 PM > To: Kevin Geng > Subject: [rt.cpan.org #100283] Bug about Tk > > <URL: https://rt.cpan.org/Ticket/Display.html?id=100283 > > > On 2014-11-12 01:07:22, Kevin.Geng@imgtec.com wrote:
> > Hi, > > > > When I install Tk in linux platform, I found the following error when > > execute "make test": > > > > > > 17464da0 is not a hash at /usr/lib64/perl5/site_perl/5.8.8/x86_64- > > linux-thread-multi/Tk/MainWindow.pm line 53. > > > > Abort > > > > Line 53 in MainWindow.pm is: > > my $top = eval { bless Create($package->CreateArgs(\%args)), > > $package > > }; > > > > After the installation, When I running perl script which use Tk. > > It still report the above error message. > > > > Could you please help to debug this bug and how to fix it?
> > Can you send me the log of "make test" and tell me the exact linux > distribution you're using, along with the perl version?
Unfortunately I cannot reproduce the problem. I tried the latest Tk from github (there are not that many changes since 804.032 here) on a VM running CentOS 5.10 (I don't have older CentOS versions available), and the test suite runs without problems. Does at least "perl -Mblib t/00wmcheck.t" run? If so, can you send me the output? Do you have freetype libraries and includes installed? Maybe you can try either XFT=0 or XFT=1 in the "perl Makefile.PL" line to turn freetype support on or off?
Subject: RE: [rt.cpan.org #100283] Test suite aborts with "... is not a hash"
Date: Tue, 18 Nov 2014 10:46:02 +0000
To: "bug-Tk [...] rt.cpan.org" <bug-Tk [...] rt.cpan.org>
From: Kevin Geng <Kevin.Geng [...] imgtec.com>
Download (untitled) / with headers
text/plain 9.4k
Hi Slaven, I am so sorry for the late response since I am not in the office these days. I have tried the command "perl -Mblib t/00wmcheck.t" and the output is "Can not open perl script "t/00wmcheck.t": No such file or directory". After googling this problem, I found It has something to do with X11 installation. Other people has this problem and fix it with a simple symlink "ln -s /etc/X11/rgb.txt /usr/X11R6/lib/X11/". But I can not create this link since the path is not exist. I will ask my friend help to check and install X11. Will let you know the result if it works. Thank you so much for your kindly help! Best Regards Kevin Show quoted text
-----Original Message----- From: Slaven_Rezic via RT [mailto:bug-Tk@rt.cpan.org] Sent: Sunday, November 16, 2014 10:42 PM To: Kevin Geng Subject: [rt.cpan.org #100283] Test suite aborts with "... is not a hash" <URL: https://rt.cpan.org/Ticket/Display.html?id=100283 > On 2014-11-12 04:12:21, Kevin.Geng@imgtec.com wrote:
> Hi Slaven, > > Thanks you so much for your quick response and kindly help! > The perl version is: 5.8.8/x86_64-linux-thread-multi The linux > distribution is : 2.6.18-274.12.1.el5 Distributor ID: CentOS > Description: CentOS release 5.7 (Final) > The log of "make test" is: > --- cd pTk && make DEFINE="" LIBPERL_A="libperl.a" LINKTYPE="dynamic" > OPTIMIZE="-O2 -g -pipe -Wall -Wp,-D_FORTIFY_SOURCE=2 -fexceptions > -fstack-protector > --param=ssp-buffer-size=4 -m64 -mtune=generic" PREFIX="/usr" > PASTHRU_DEFINE="" > PASTHRU_INC="" > make[1]: Entering directory > `/home/hxgeng/hxgeng/my_script/perl_xml/testing/tk/Tk-804.032/pTk' > make[1]: Leaving directory > `/home/hxgeng/hxgeng/my_script/perl_xml/testing/tk/Tk-804.032/pTk' > make[1]: Entering directory > `/home/hxgeng/hxgeng/my_script/perl_xml/testing/tk/Tk-804.032/pTk' > make[1]: Leaving directory > `/home/hxgeng/hxgeng/my_script/perl_xml/testing/tk/Tk-804.032/pTk' > make[1]: Entering directory > `/home/hxgeng/hxgeng/my_script/perl_xml/testing/tk/Tk-804.032/pod' > Manifying 101 pod documents > make[1]: Leaving directory > `/home/hxgeng/hxgeng/my_script/perl_xml/testing/tk/Tk-804.032/pod' > make[1]: Entering directory > `/home/hxgeng/hxgeng/my_script/perl_xml/testing/tk/Tk-804.032/demos' > Manifying 1 pod document > Manifying 2 pod documents > make[1]: Leaving directory > `/home/hxgeng/hxgeng/my_script/perl_xml/testing/tk/Tk-804.032/demos' > make[1]: Entering directory > `/home/hxgeng/hxgeng/my_script/perl_xml/testing/tk/Tk-804.032/Xlib' > make[2]: Entering directory > `/home/hxgeng/hxgeng/my_script/perl_xml/testing/tk/Tk-804.032/Xlib/X' > make[2]: Leaving directory > `/home/hxgeng/hxgeng/my_script/perl_xml/testing/tk/Tk-804.032/Xlib/X' > make[1]: Leaving directory > `/home/hxgeng/hxgeng/my_script/perl_xml/testing/tk/Tk-804.032/Xlib' > make[1]: Entering directory > `/home/hxgeng/hxgeng/my_script/perl_xml/testing/tk/Tk- > 804.032/WinPhoto' > Manifying 1 pod document > make[1]: Leaving directory > `/home/hxgeng/hxgeng/my_script/perl_xml/testing/tk/Tk- > 804.032/WinPhoto' > make[1]: Entering directory > `/home/hxgeng/hxgeng/my_script/perl_xml/testing/tk/Tk-804.032/Tixish' > make[1]: Leaving directory > `/home/hxgeng/hxgeng/my_script/perl_xml/testing/tk/Tk-804.032/Tixish' > make[1]: Entering directory > `/home/hxgeng/hxgeng/my_script/perl_xml/testing/tk/Tk- > 804.032/TixPixmap' > make[1]: Leaving directory > `/home/hxgeng/hxgeng/my_script/perl_xml/testing/tk/Tk- > 804.032/TixPixmap' > make[1]: Entering directory > `/home/hxgeng/hxgeng/my_script/perl_xml/testing/tk/Tk-804.032/TixGrid' > make[1]: Leaving directory > `/home/hxgeng/hxgeng/my_script/perl_xml/testing/tk/Tk-804.032/TixGrid' > make[1]: Entering directory > `/home/hxgeng/hxgeng/my_script/perl_xml/testing/tk/Tk- > 804.032/TextList' > Manifying 1 pod document > make[1]: Leaving directory > `/home/hxgeng/hxgeng/my_script/perl_xml/testing/tk/Tk- > 804.032/TextList' > make[1]: Entering directory > `/home/hxgeng/hxgeng/my_script/perl_xml/testing/tk/Tk-804.032/Text' > make[1]: Leaving directory > `/home/hxgeng/hxgeng/my_script/perl_xml/testing/tk/Tk-804.032/Text' > make[1]: Entering directory > `/home/hxgeng/hxgeng/my_script/perl_xml/testing/tk/Tk-804.032/TList' > make[1]: Leaving directory > `/home/hxgeng/hxgeng/my_script/perl_xml/testing/tk/Tk-804.032/TList' > make[1]: Entering directory > `/home/hxgeng/hxgeng/my_script/perl_xml/testing/tk/Tk- > 804.032/Scrollbar' > make[1]: Leaving directory > `/home/hxgeng/hxgeng/my_script/perl_xml/testing/tk/Tk- > 804.032/Scrollbar' > make[1]: Entering directory > `/home/hxgeng/hxgeng/my_script/perl_xml/testing/tk/Tk-804.032/Scale' > make[1]: Leaving directory > `/home/hxgeng/hxgeng/my_script/perl_xml/testing/tk/Tk-804.032/Scale' > make[1]: Entering directory > `/home/hxgeng/hxgeng/my_script/perl_xml/testing/tk/Tk-804.032/PNG' > Manifying 1 pod document > make[1]: Leaving directory > `/home/hxgeng/hxgeng/my_script/perl_xml/testing/tk/Tk-804.032/PNG' > make[1]: Entering directory > `/home/hxgeng/hxgeng/my_script/perl_xml/testing/tk/Tk-804.032/NBFrame' > make[1]: Leaving directory > `/home/hxgeng/hxgeng/my_script/perl_xml/testing/tk/Tk-804.032/NBFrame' > make[1]: Entering directory > `/home/hxgeng/hxgeng/my_script/perl_xml/testing/tk/Tk-804.032/Mwm' > make[1]: Leaving directory > `/home/hxgeng/hxgeng/my_script/perl_xml/testing/tk/Tk-804.032/Mwm' > make[1]: Entering directory > `/home/hxgeng/hxgeng/my_script/perl_xml/testing/tk/Tk- > 804.032/Menubutton' > make[1]: Leaving directory > `/home/hxgeng/hxgeng/my_script/perl_xml/testing/tk/Tk- > 804.032/Menubutton' > make[1]: Entering directory > `/home/hxgeng/hxgeng/my_script/perl_xml/testing/tk/Tk-804.032/Listbox' > make[1]: Leaving directory > `/home/hxgeng/hxgeng/my_script/perl_xml/testing/tk/Tk-804.032/Listbox' > make[1]: Entering directory > `/home/hxgeng/hxgeng/my_script/perl_xml/testing/tk/Tk-804.032/JPEG' > Manifying 1 pod document > Manifying 1 pod document > make[1]: Leaving directory > `/home/hxgeng/hxgeng/my_script/perl_xml/testing/tk/Tk-804.032/JPEG' > make[1]: Entering directory > `/home/hxgeng/hxgeng/my_script/perl_xml/testing/tk/Tk-804.032/InputO' > make[1]: Leaving directory > `/home/hxgeng/hxgeng/my_script/perl_xml/testing/tk/Tk-804.032/InputO' > make[1]: Entering directory > `/home/hxgeng/hxgeng/my_script/perl_xml/testing/tk/Tk-804.032/IO' > make[1]: Leaving directory > `/home/hxgeng/hxgeng/my_script/perl_xml/testing/tk/Tk-804.032/IO' > make[1]: Entering directory > `/home/hxgeng/hxgeng/my_script/perl_xml/testing/tk/Tk-804.032/HList' > make[1]: Leaving directory > `/home/hxgeng/hxgeng/my_script/perl_xml/testing/tk/Tk-804.032/HList' > make[1]: Entering directory > `/home/hxgeng/hxgeng/my_script/perl_xml/testing/tk/Tk-804.032/Event' > make[1]: Leaving directory > `/home/hxgeng/hxgeng/my_script/perl_xml/testing/tk/Tk-804.032/Event' > make[1]: Entering directory > `/home/hxgeng/hxgeng/my_script/perl_xml/testing/tk/Tk-804.032/Entry' > make[1]: Leaving directory > `/home/hxgeng/hxgeng/my_script/perl_xml/testing/tk/Tk-804.032/Entry' > make[1]: Entering directory > `/home/hxgeng/hxgeng/my_script/perl_xml/testing/tk/Tk- > 804.032/DragDrop' > Manifying 3 pod documents > make[1]: Leaving directory > `/home/hxgeng/hxgeng/my_script/perl_xml/testing/tk/Tk- > 804.032/DragDrop' > make[1]: Entering directory > `/home/hxgeng/hxgeng/my_script/perl_xml/testing/tk/Tk- > 804.032/Compound' > make[1]: Leaving directory > `/home/hxgeng/hxgeng/my_script/perl_xml/testing/tk/Tk- > 804.032/Compound' > make[1]: Entering directory > `/home/hxgeng/hxgeng/my_script/perl_xml/testing/tk/Tk-804.032/Canvas' > make[1]: Leaving directory > `/home/hxgeng/hxgeng/my_script/perl_xml/testing/tk/Tk-804.032/Canvas' > /usr/bin/perl "-It" "-MTkTest" "-e" "checked_test_harness('./xt', 0, > 'blib/lib', 'blib/arch')" > ba67d70 is not a hash at > /home/hxgeng/hxgeng/my_script/perl_xml/testing/tk/Tk- > 804.032/blib/lib/Tk/MainWindow.pm > line 53. > make: *** [test_dynamic] Aborted > > > Thanks > Kevin > -----Original Message----- > From: Slaven_Rezic via RT [mailto:bug-Tk@rt.cpan.org] > Sent: Wednesday, November 12, 2014 2:59 PM > To: Kevin Geng > Subject: [rt.cpan.org #100283] Bug about Tk > > <URL: https://rt.cpan.org/Ticket/Display.html?id=100283 > > > On 2014-11-12 01:07:22, Kevin.Geng@imgtec.com wrote:
> > Hi, > > > > When I install Tk in linux platform, I found the following error > > when execute "make test": > > > > > > 17464da0 is not a hash at /usr/lib64/perl5/site_perl/5.8.8/x86_64- > > linux-thread-multi/Tk/MainWindow.pm line 53. > > > > Abort > > > > Line 53 in MainWindow.pm is: > > my $top = eval { bless Create($package->CreateArgs(\%args)), > > $package > > }; > > > > After the installation, When I running perl script which use Tk. > > It still report the above error message. > > > > Could you please help to debug this bug and how to fix it?
> > Can you send me the log of "make test" and tell me the exact linux > distribution you're using, along with the perl version?
Unfortunately I cannot reproduce the problem. I tried the latest Tk from github (there are not that many changes since 804.032 here) on a VM running CentOS 5.10 (I don't have older CentOS versions available), and the test suite runs without problems. Does at least "perl -Mblib t/00wmcheck.t" run? If so, can you send me the output? Do you have freetype libraries and includes installed? Maybe you can try either XFT=0 or XFT=1 in the "perl Makefile.PL" line to turn freetype support on or off?
Download (untitled) / with headers
text/plain 9.8k
Hi Kevin, do you have any news on this issue? Regards, Slaven On 2014-11-18 05:46:18, Kevin.Geng@imgtec.com wrote: Show quoted text
> Hi Slaven, > > I am so sorry for the late response since I am not in the office these > days. > I have tried the command "perl -Mblib t/00wmcheck.t" and the output is > "Can not open perl script "t/00wmcheck.t": No such file or directory". > After googling this problem, I found It has something to do with X11 > installation. > Other people has this problem and fix it with a simple symlink "ln -s > /etc/X11/rgb.txt /usr/X11R6/lib/X11/". > But I can not create this link since the path is not exist. > I will ask my friend help to check and install X11. > Will let you know the result if it works. > Thank you so much for your kindly help! > > Best Regards > Kevin > > -----Original Message----- > From: Slaven_Rezic via RT [mailto:bug-Tk@rt.cpan.org] > Sent: Sunday, November 16, 2014 10:42 PM > To: Kevin Geng > Subject: [rt.cpan.org #100283] Test suite aborts with "... is not a > hash" > > <URL: https://rt.cpan.org/Ticket/Display.html?id=100283 > > > On 2014-11-12 04:12:21, Kevin.Geng@imgtec.com wrote:
> > Hi Slaven, > > > > Thanks you so much for your quick response and kindly help! > > The perl version is: 5.8.8/x86_64-linux-thread-multi The linux > > distribution is : 2.6.18-274.12.1.el5 Distributor ID: CentOS > > Description: CentOS release 5.7 (Final) > > The log of "make test" is: > > --- cd pTk && make DEFINE="" LIBPERL_A="libperl.a" LINKTYPE="dynamic" > > OPTIMIZE="-O2 -g -pipe -Wall -Wp,-D_FORTIFY_SOURCE=2 -fexceptions > > -fstack-protector > > --param=ssp-buffer-size=4 -m64 -mtune=generic" PREFIX="/usr" > > PASTHRU_DEFINE="" > > PASTHRU_INC="" > > make[1]: Entering directory > > `/home/hxgeng/hxgeng/my_script/perl_xml/testing/tk/Tk-804.032/pTk' > > make[1]: Leaving directory > > `/home/hxgeng/hxgeng/my_script/perl_xml/testing/tk/Tk-804.032/pTk' > > make[1]: Entering directory > > `/home/hxgeng/hxgeng/my_script/perl_xml/testing/tk/Tk-804.032/pTk' > > make[1]: Leaving directory > > `/home/hxgeng/hxgeng/my_script/perl_xml/testing/tk/Tk-804.032/pTk' > > make[1]: Entering directory > > `/home/hxgeng/hxgeng/my_script/perl_xml/testing/tk/Tk-804.032/pod' > > Manifying 101 pod documents > > make[1]: Leaving directory > > `/home/hxgeng/hxgeng/my_script/perl_xml/testing/tk/Tk-804.032/pod' > > make[1]: Entering directory > > `/home/hxgeng/hxgeng/my_script/perl_xml/testing/tk/Tk-804.032/demos' > > Manifying 1 pod document > > Manifying 2 pod documents > > make[1]: Leaving directory > > `/home/hxgeng/hxgeng/my_script/perl_xml/testing/tk/Tk-804.032/demos' > > make[1]: Entering directory > > `/home/hxgeng/hxgeng/my_script/perl_xml/testing/tk/Tk-804.032/Xlib' > > make[2]: Entering directory > > `/home/hxgeng/hxgeng/my_script/perl_xml/testing/tk/Tk-804.032/Xlib/X' > > make[2]: Leaving directory > > `/home/hxgeng/hxgeng/my_script/perl_xml/testing/tk/Tk-804.032/Xlib/X' > > make[1]: Leaving directory > > `/home/hxgeng/hxgeng/my_script/perl_xml/testing/tk/Tk-804.032/Xlib' > > make[1]: Entering directory > > `/home/hxgeng/hxgeng/my_script/perl_xml/testing/tk/Tk- > > 804.032/WinPhoto' > > Manifying 1 pod document > > make[1]: Leaving directory > > `/home/hxgeng/hxgeng/my_script/perl_xml/testing/tk/Tk- > > 804.032/WinPhoto' > > make[1]: Entering directory > > `/home/hxgeng/hxgeng/my_script/perl_xml/testing/tk/Tk-804.032/Tixish' > > make[1]: Leaving directory > > `/home/hxgeng/hxgeng/my_script/perl_xml/testing/tk/Tk-804.032/Tixish' > > make[1]: Entering directory > > `/home/hxgeng/hxgeng/my_script/perl_xml/testing/tk/Tk- > > 804.032/TixPixmap' > > make[1]: Leaving directory > > `/home/hxgeng/hxgeng/my_script/perl_xml/testing/tk/Tk- > > 804.032/TixPixmap' > > make[1]: Entering directory > > `/home/hxgeng/hxgeng/my_script/perl_xml/testing/tk/Tk- > > 804.032/TixGrid' > > make[1]: Leaving directory > > `/home/hxgeng/hxgeng/my_script/perl_xml/testing/tk/Tk- > > 804.032/TixGrid' > > make[1]: Entering directory > > `/home/hxgeng/hxgeng/my_script/perl_xml/testing/tk/Tk- > > 804.032/TextList' > > Manifying 1 pod document > > make[1]: Leaving directory > > `/home/hxgeng/hxgeng/my_script/perl_xml/testing/tk/Tk- > > 804.032/TextList' > > make[1]: Entering directory > > `/home/hxgeng/hxgeng/my_script/perl_xml/testing/tk/Tk-804.032/Text' > > make[1]: Leaving directory > > `/home/hxgeng/hxgeng/my_script/perl_xml/testing/tk/Tk-804.032/Text' > > make[1]: Entering directory > > `/home/hxgeng/hxgeng/my_script/perl_xml/testing/tk/Tk-804.032/TList' > > make[1]: Leaving directory > > `/home/hxgeng/hxgeng/my_script/perl_xml/testing/tk/Tk-804.032/TList' > > make[1]: Entering directory > > `/home/hxgeng/hxgeng/my_script/perl_xml/testing/tk/Tk- > > 804.032/Scrollbar' > > make[1]: Leaving directory > > `/home/hxgeng/hxgeng/my_script/perl_xml/testing/tk/Tk- > > 804.032/Scrollbar' > > make[1]: Entering directory > > `/home/hxgeng/hxgeng/my_script/perl_xml/testing/tk/Tk-804.032/Scale' > > make[1]: Leaving directory > > `/home/hxgeng/hxgeng/my_script/perl_xml/testing/tk/Tk-804.032/Scale' > > make[1]: Entering directory > > `/home/hxgeng/hxgeng/my_script/perl_xml/testing/tk/Tk-804.032/PNG' > > Manifying 1 pod document > > make[1]: Leaving directory > > `/home/hxgeng/hxgeng/my_script/perl_xml/testing/tk/Tk-804.032/PNG' > > make[1]: Entering directory > > `/home/hxgeng/hxgeng/my_script/perl_xml/testing/tk/Tk- > > 804.032/NBFrame' > > make[1]: Leaving directory > > `/home/hxgeng/hxgeng/my_script/perl_xml/testing/tk/Tk- > > 804.032/NBFrame' > > make[1]: Entering directory > > `/home/hxgeng/hxgeng/my_script/perl_xml/testing/tk/Tk-804.032/Mwm' > > make[1]: Leaving directory > > `/home/hxgeng/hxgeng/my_script/perl_xml/testing/tk/Tk-804.032/Mwm' > > make[1]: Entering directory > > `/home/hxgeng/hxgeng/my_script/perl_xml/testing/tk/Tk- > > 804.032/Menubutton' > > make[1]: Leaving directory > > `/home/hxgeng/hxgeng/my_script/perl_xml/testing/tk/Tk- > > 804.032/Menubutton' > > make[1]: Entering directory > > `/home/hxgeng/hxgeng/my_script/perl_xml/testing/tk/Tk- > > 804.032/Listbox' > > make[1]: Leaving directory > > `/home/hxgeng/hxgeng/my_script/perl_xml/testing/tk/Tk- > > 804.032/Listbox' > > make[1]: Entering directory > > `/home/hxgeng/hxgeng/my_script/perl_xml/testing/tk/Tk-804.032/JPEG' > > Manifying 1 pod document > > Manifying 1 pod document > > make[1]: Leaving directory > > `/home/hxgeng/hxgeng/my_script/perl_xml/testing/tk/Tk-804.032/JPEG' > > make[1]: Entering directory > > `/home/hxgeng/hxgeng/my_script/perl_xml/testing/tk/Tk-804.032/InputO' > > make[1]: Leaving directory > > `/home/hxgeng/hxgeng/my_script/perl_xml/testing/tk/Tk-804.032/InputO' > > make[1]: Entering directory > > `/home/hxgeng/hxgeng/my_script/perl_xml/testing/tk/Tk-804.032/IO' > > make[1]: Leaving directory > > `/home/hxgeng/hxgeng/my_script/perl_xml/testing/tk/Tk-804.032/IO' > > make[1]: Entering directory > > `/home/hxgeng/hxgeng/my_script/perl_xml/testing/tk/Tk-804.032/HList' > > make[1]: Leaving directory > > `/home/hxgeng/hxgeng/my_script/perl_xml/testing/tk/Tk-804.032/HList' > > make[1]: Entering directory > > `/home/hxgeng/hxgeng/my_script/perl_xml/testing/tk/Tk-804.032/Event' > > make[1]: Leaving directory > > `/home/hxgeng/hxgeng/my_script/perl_xml/testing/tk/Tk-804.032/Event' > > make[1]: Entering directory > > `/home/hxgeng/hxgeng/my_script/perl_xml/testing/tk/Tk-804.032/Entry' > > make[1]: Leaving directory > > `/home/hxgeng/hxgeng/my_script/perl_xml/testing/tk/Tk-804.032/Entry' > > make[1]: Entering directory > > `/home/hxgeng/hxgeng/my_script/perl_xml/testing/tk/Tk- > > 804.032/DragDrop' > > Manifying 3 pod documents > > make[1]: Leaving directory > > `/home/hxgeng/hxgeng/my_script/perl_xml/testing/tk/Tk- > > 804.032/DragDrop' > > make[1]: Entering directory > > `/home/hxgeng/hxgeng/my_script/perl_xml/testing/tk/Tk- > > 804.032/Compound' > > make[1]: Leaving directory > > `/home/hxgeng/hxgeng/my_script/perl_xml/testing/tk/Tk- > > 804.032/Compound' > > make[1]: Entering directory > > `/home/hxgeng/hxgeng/my_script/perl_xml/testing/tk/Tk-804.032/Canvas' > > make[1]: Leaving directory > > `/home/hxgeng/hxgeng/my_script/perl_xml/testing/tk/Tk-804.032/Canvas' > > /usr/bin/perl "-It" "-MTkTest" "-e" "checked_test_harness('./xt', > > 0, > > 'blib/lib', 'blib/arch')" > > ba67d70 is not a hash at > > /home/hxgeng/hxgeng/my_script/perl_xml/testing/tk/Tk- > > 804.032/blib/lib/Tk/MainWindow.pm > > line 53. > > make: *** [test_dynamic] Aborted > > > > > > Thanks > > Kevin > > -----Original Message----- > > From: Slaven_Rezic via RT [mailto:bug-Tk@rt.cpan.org] > > Sent: Wednesday, November 12, 2014 2:59 PM > > To: Kevin Geng > > Subject: [rt.cpan.org #100283] Bug about Tk > > > > <URL: https://rt.cpan.org/Ticket/Display.html?id=100283 > > > > > On 2014-11-12 01:07:22, Kevin.Geng@imgtec.com wrote:
> > > Hi, > > > > > > When I install Tk in linux platform, I found the following error > > > when execute "make test": > > > > > > > > > 17464da0 is not a hash at /usr/lib64/perl5/site_perl/5.8.8/x86_64- > > > linux-thread-multi/Tk/MainWindow.pm line 53. > > > > > > Abort > > > > > > Line 53 in MainWindow.pm is: > > > my $top = eval { bless Create($package->CreateArgs(\%args)), > > > $package > > > }; > > > > > > After the installation, When I running perl script which use Tk. > > > It still report the above error message. > > > > > > Could you please help to debug this bug and how to fix it?
> > > > Can you send me the log of "make test" and tell me the exact linux > > distribution you're using, along with the perl version?
> > Unfortunately I cannot reproduce the problem. I tried the latest Tk > from github (there are not that many changes since 804.032 here) on a > VM running CentOS 5.10 (I don't have older CentOS versions available), > and the test suite runs without problems. > > Does at least "perl -Mblib t/00wmcheck.t" run? If so, can you send me > the output? Do you have freetype libraries and includes installed? > Maybe you can try either XFT=0 or XFT=1 in the "perl Makefile.PL" line > to turn freetype support on or off?
Subject: 答复: [rt.cpan.org #100283] Test suite aborts with "... is not a hash"
Date: Mon, 2 Feb 2015 03:50:03 +0000
To: "bug-Tk [...] rt.cpan.org" <bug-Tk [...] rt.cpan.org>
From: Kevin Geng <Kevin.Geng [...] imgtec.com>
Download (untitled) / with headers
text/plain 10.5k
Hi Slaven, After X11 installation, the issue still exist. I guess my machine has some problems. But I have another machine which has a fully X11 installation, and it works on this machine. Now I use it as my work machine. Thanks Kevin Show quoted text
________________________________________ 发件人: Slaven_Rezic via RT [bug-Tk@rt.cpan.org] 发送时间: 2015年1月31日 11:09 收件人: Kevin Geng 主题: [rt.cpan.org #100283] Test suite aborts with "... is not a hash" <URL: https://rt.cpan.org/Ticket/Display.html?id=100283 > Hi Kevin, do you have any news on this issue? Regards, Slaven On 2014-11-18 05:46:18, Kevin.Geng@imgtec.com wrote:
> Hi Slaven, > > I am so sorry for the late response since I am not in the office these > days. > I have tried the command "perl -Mblib t/00wmcheck.t" and the output is > "Can not open perl script "t/00wmcheck.t": No such file or directory". > After googling this problem, I found It has something to do with X11 > installation. > Other people has this problem and fix it with a simple symlink "ln -s > /etc/X11/rgb.txt /usr/X11R6/lib/X11/". > But I can not create this link since the path is not exist. > I will ask my friend help to check and install X11. > Will let you know the result if it works. > Thank you so much for your kindly help! > > Best Regards > Kevin > > -----Original Message----- > From: Slaven_Rezic via RT [mailto:bug-Tk@rt.cpan.org] > Sent: Sunday, November 16, 2014 10:42 PM > To: Kevin Geng > Subject: [rt.cpan.org #100283] Test suite aborts with "... is not a > hash" > > <URL: https://rt.cpan.org/Ticket/Display.html?id=100283 > > > On 2014-11-12 04:12:21, Kevin.Geng@imgtec.com wrote:
> > Hi Slaven, > > > > Thanks you so much for your quick response and kindly help! > > The perl version is: 5.8.8/x86_64-linux-thread-multi The linux > > distribution is : 2.6.18-274.12.1.el5 Distributor ID: CentOS > > Description: CentOS release 5.7 (Final) > > The log of "make test" is: > > --- cd pTk && make DEFINE="" LIBPERL_A="libperl.a" LINKTYPE="dynamic" > > OPTIMIZE="-O2 -g -pipe -Wall -Wp,-D_FORTIFY_SOURCE=2 -fexceptions > > -fstack-protector > > --param=ssp-buffer-size=4 -m64 -mtune=generic" PREFIX="/usr" > > PASTHRU_DEFINE="" > > PASTHRU_INC="" > > make[1]: Entering directory > > `/home/hxgeng/hxgeng/my_script/perl_xml/testing/tk/Tk-804.032/pTk' > > make[1]: Leaving directory > > `/home/hxgeng/hxgeng/my_script/perl_xml/testing/tk/Tk-804.032/pTk' > > make[1]: Entering directory > > `/home/hxgeng/hxgeng/my_script/perl_xml/testing/tk/Tk-804.032/pTk' > > make[1]: Leaving directory > > `/home/hxgeng/hxgeng/my_script/perl_xml/testing/tk/Tk-804.032/pTk' > > make[1]: Entering directory > > `/home/hxgeng/hxgeng/my_script/perl_xml/testing/tk/Tk-804.032/pod' > > Manifying 101 pod documents > > make[1]: Leaving directory > > `/home/hxgeng/hxgeng/my_script/perl_xml/testing/tk/Tk-804.032/pod' > > make[1]: Entering directory > > `/home/hxgeng/hxgeng/my_script/perl_xml/testing/tk/Tk-804.032/demos' > > Manifying 1 pod document > > Manifying 2 pod documents > > make[1]: Leaving directory > > `/home/hxgeng/hxgeng/my_script/perl_xml/testing/tk/Tk-804.032/demos' > > make[1]: Entering directory > > `/home/hxgeng/hxgeng/my_script/perl_xml/testing/tk/Tk-804.032/Xlib' > > make[2]: Entering directory > > `/home/hxgeng/hxgeng/my_script/perl_xml/testing/tk/Tk-804.032/Xlib/X' > > make[2]: Leaving directory > > `/home/hxgeng/hxgeng/my_script/perl_xml/testing/tk/Tk-804.032/Xlib/X' > > make[1]: Leaving directory > > `/home/hxgeng/hxgeng/my_script/perl_xml/testing/tk/Tk-804.032/Xlib' > > make[1]: Entering directory > > `/home/hxgeng/hxgeng/my_script/perl_xml/testing/tk/Tk- > > 804.032/WinPhoto' > > Manifying 1 pod document > > make[1]: Leaving directory > > `/home/hxgeng/hxgeng/my_script/perl_xml/testing/tk/Tk- > > 804.032/WinPhoto' > > make[1]: Entering directory > > `/home/hxgeng/hxgeng/my_script/perl_xml/testing/tk/Tk-804.032/Tixish' > > make[1]: Leaving directory > > `/home/hxgeng/hxgeng/my_script/perl_xml/testing/tk/Tk-804.032/Tixish' > > make[1]: Entering directory > > `/home/hxgeng/hxgeng/my_script/perl_xml/testing/tk/Tk- > > 804.032/TixPixmap' > > make[1]: Leaving directory > > `/home/hxgeng/hxgeng/my_script/perl_xml/testing/tk/Tk- > > 804.032/TixPixmap' > > make[1]: Entering directory > > `/home/hxgeng/hxgeng/my_script/perl_xml/testing/tk/Tk- > > 804.032/TixGrid' > > make[1]: Leaving directory > > `/home/hxgeng/hxgeng/my_script/perl_xml/testing/tk/Tk- > > 804.032/TixGrid' > > make[1]: Entering directory > > `/home/hxgeng/hxgeng/my_script/perl_xml/testing/tk/Tk- > > 804.032/TextList' > > Manifying 1 pod document > > make[1]: Leaving directory > > `/home/hxgeng/hxgeng/my_script/perl_xml/testing/tk/Tk- > > 804.032/TextList' > > make[1]: Entering directory > > `/home/hxgeng/hxgeng/my_script/perl_xml/testing/tk/Tk-804.032/Text' > > make[1]: Leaving directory > > `/home/hxgeng/hxgeng/my_script/perl_xml/testing/tk/Tk-804.032/Text' > > make[1]: Entering directory > > `/home/hxgeng/hxgeng/my_script/perl_xml/testing/tk/Tk-804.032/TList' > > make[1]: Leaving directory > > `/home/hxgeng/hxgeng/my_script/perl_xml/testing/tk/Tk-804.032/TList' > > make[1]: Entering directory > > `/home/hxgeng/hxgeng/my_script/perl_xml/testing/tk/Tk- > > 804.032/Scrollbar' > > make[1]: Leaving directory > > `/home/hxgeng/hxgeng/my_script/perl_xml/testing/tk/Tk- > > 804.032/Scrollbar' > > make[1]: Entering directory > > `/home/hxgeng/hxgeng/my_script/perl_xml/testing/tk/Tk-804.032/Scale' > > make[1]: Leaving directory > > `/home/hxgeng/hxgeng/my_script/perl_xml/testing/tk/Tk-804.032/Scale' > > make[1]: Entering directory > > `/home/hxgeng/hxgeng/my_script/perl_xml/testing/tk/Tk-804.032/PNG' > > Manifying 1 pod document > > make[1]: Leaving directory > > `/home/hxgeng/hxgeng/my_script/perl_xml/testing/tk/Tk-804.032/PNG' > > make[1]: Entering directory > > `/home/hxgeng/hxgeng/my_script/perl_xml/testing/tk/Tk- > > 804.032/NBFrame' > > make[1]: Leaving directory > > `/home/hxgeng/hxgeng/my_script/perl_xml/testing/tk/Tk- > > 804.032/NBFrame' > > make[1]: Entering directory > > `/home/hxgeng/hxgeng/my_script/perl_xml/testing/tk/Tk-804.032/Mwm' > > make[1]: Leaving directory > > `/home/hxgeng/hxgeng/my_script/perl_xml/testing/tk/Tk-804.032/Mwm' > > make[1]: Entering directory > > `/home/hxgeng/hxgeng/my_script/perl_xml/testing/tk/Tk- > > 804.032/Menubutton' > > make[1]: Leaving directory > > `/home/hxgeng/hxgeng/my_script/perl_xml/testing/tk/Tk- > > 804.032/Menubutton' > > make[1]: Entering directory > > `/home/hxgeng/hxgeng/my_script/perl_xml/testing/tk/Tk- > > 804.032/Listbox' > > make[1]: Leaving directory > > `/home/hxgeng/hxgeng/my_script/perl_xml/testing/tk/Tk- > > 804.032/Listbox' > > make[1]: Entering directory > > `/home/hxgeng/hxgeng/my_script/perl_xml/testing/tk/Tk-804.032/JPEG' > > Manifying 1 pod document > > Manifying 1 pod document > > make[1]: Leaving directory > > `/home/hxgeng/hxgeng/my_script/perl_xml/testing/tk/Tk-804.032/JPEG' > > make[1]: Entering directory > > `/home/hxgeng/hxgeng/my_script/perl_xml/testing/tk/Tk-804.032/InputO' > > make[1]: Leaving directory > > `/home/hxgeng/hxgeng/my_script/perl_xml/testing/tk/Tk-804.032/InputO' > > make[1]: Entering directory > > `/home/hxgeng/hxgeng/my_script/perl_xml/testing/tk/Tk-804.032/IO' > > make[1]: Leaving directory > > `/home/hxgeng/hxgeng/my_script/perl_xml/testing/tk/Tk-804.032/IO' > > make[1]: Entering directory > > `/home/hxgeng/hxgeng/my_script/perl_xml/testing/tk/Tk-804.032/HList' > > make[1]: Leaving directory > > `/home/hxgeng/hxgeng/my_script/perl_xml/testing/tk/Tk-804.032/HList' > > make[1]: Entering directory > > `/home/hxgeng/hxgeng/my_script/perl_xml/testing/tk/Tk-804.032/Event' > > make[1]: Leaving directory > > `/home/hxgeng/hxgeng/my_script/perl_xml/testing/tk/Tk-804.032/Event' > > make[1]: Entering directory > > `/home/hxgeng/hxgeng/my_script/perl_xml/testing/tk/Tk-804.032/Entry' > > make[1]: Leaving directory > > `/home/hxgeng/hxgeng/my_script/perl_xml/testing/tk/Tk-804.032/Entry' > > make[1]: Entering directory > > `/home/hxgeng/hxgeng/my_script/perl_xml/testing/tk/Tk- > > 804.032/DragDrop' > > Manifying 3 pod documents > > make[1]: Leaving directory > > `/home/hxgeng/hxgeng/my_script/perl_xml/testing/tk/Tk- > > 804.032/DragDrop' > > make[1]: Entering directory > > `/home/hxgeng/hxgeng/my_script/perl_xml/testing/tk/Tk- > > 804.032/Compound' > > make[1]: Leaving directory > > `/home/hxgeng/hxgeng/my_script/perl_xml/testing/tk/Tk- > > 804.032/Compound' > > make[1]: Entering directory > > `/home/hxgeng/hxgeng/my_script/perl_xml/testing/tk/Tk-804.032/Canvas' > > make[1]: Leaving directory > > `/home/hxgeng/hxgeng/my_script/perl_xml/testing/tk/Tk-804.032/Canvas' > > /usr/bin/perl "-It" "-MTkTest" "-e" "checked_test_harness('./xt', > > 0, > > 'blib/lib', 'blib/arch')" > > ba67d70 is not a hash at > > /home/hxgeng/hxgeng/my_script/perl_xml/testing/tk/Tk- > > 804.032/blib/lib/Tk/MainWindow.pm > > line 53. > > make: *** [test_dynamic] Aborted > > > > > > Thanks > > Kevin > > -----Original Message----- > > From: Slaven_Rezic via RT [mailto:bug-Tk@rt.cpan.org] > > Sent: Wednesday, November 12, 2014 2:59 PM > > To: Kevin Geng > > Subject: [rt.cpan.org #100283] Bug about Tk > > > > <URL: https://rt.cpan.org/Ticket/Display.html?id=100283 > > > > > On 2014-11-12 01:07:22, Kevin.Geng@imgtec.com wrote:
> > > Hi, > > > > > > When I install Tk in linux platform, I found the following error > > > when execute "make test": > > > > > > > > > 17464da0 is not a hash at /usr/lib64/perl5/site_perl/5.8.8/x86_64- > > > linux-thread-multi/Tk/MainWindow.pm line 53. > > > > > > Abort > > > > > > Line 53 in MainWindow.pm is: > > > my $top = eval { bless Create($package->CreateArgs(\%args)), > > > $package > > > }; > > > > > > After the installation, When I running perl script which use Tk. > > > It still report the above error message. > > > > > > Could you please help to debug this bug and how to fix it?
> > > > Can you send me the log of "make test" and tell me the exact linux > > distribution you're using, along with the perl version?
> > Unfortunately I cannot reproduce the problem. I tried the latest Tk > from github (there are not that many changes since 804.032 here) on a > VM running CentOS 5.10 (I don't have older CentOS versions available), > and the test suite runs without problems. > > Does at least "perl -Mblib t/00wmcheck.t" run? If so, can you send me > the output? Do you have freetype libraries and includes installed? > Maybe you can try either XFT=0 or XFT=1 in the "perl Makefile.PL" line > to turn freetype support on or off?


This service is sponsored and maintained by Best Practical Solutions and runs on Perl.org infrastructure.

Please report any issues with rt.cpan.org to rt-cpan-admin@bestpractical.com.