Skip Menu |
 

This queue is for tickets about the DBD-mysql CPAN distribution.

Report information
The Basics
Id: 8207
Status: rejected
Priority: 0/
Queue: DBD-mysql

People
Owner: Nobody in particular
Requestors: lovan [...] lifesci.ucsb.edu
Cc:
AdminCc:

Bug Information
Severity: Critical
Broken in:
  • 2.9004
  • 2.9005_1
  • 2.9005_3
Fixed in: (no value)



Content-Type: text/plain
Content-Disposition: inline
Content-Transfer-Encoding: binary
MIME-Version: 1.0
X-Mailer: MIME-tools 5.411 (Entity 5.404)
Subject: Module dumps core under Solaris 2.8
X-RT-Original-Encoding: iso-8859-1
Content-Length: 6264
Download (untitled) / with headers
text/plain 6.1k
I am testing MySQL 4.1.x. The installation works with all of my applications execpt the DBD-Mysql. When I attempt to install the module, the compile is clean, but "make test" reports the following: $ make test PERL_DL_NONLAZY=1 /opt/bin/perl "-MExtUtils::Command::MM" "-e" "test_harness(0, 'blib/lib', 'blib/arch')" t/*.t t/00base...........ok t/10dsnlist........dubious Test returned status 0 (wstat 139, 0x8b) test program seems to have generated a core t/20createdrop.....dubious Test returned status 0 (wstat 139, 0x8b) test program seems to have generated a core t/30insertfetch....dubious Test returned status 0 (wstat 139, 0x8b) test program seems to have generated a core t/40bindparam......dubious Test returned status 0 (wstat 139, 0x8b) test program seems to have generated a core t/40blobs..........dubious Test returned status 0 (wstat 139, 0x8b) test program seems to have generated a core t/40listfields.....dubious Test returned status 0 (wstat 139, 0x8b) test program seems to have generated a core t/40nulls..........dubious Test returned status 0 (wstat 139, 0x8b) test program seems to have generated a core t/40numrows........dubious Test returned status 0 (wstat 139, 0x8b) test program seems to have generated a core t/50chopblanks.....dubious Test returned status 0 (wstat 139, 0x8b) test program seems to have generated a core t/50commit.........dubious Test returned status 0 (wstat 139, 0x8b) test program seems to have generated a core t/60leaks..........skipped all skipped: $ENV{SLOW_TESTS} is not set or Proc::ProcessTable not installed t/ak-dbd...........dubious Test returned status 0 (wstat 139, 0x8b) test program seems to have generated a core DIED. FAILED tests 1-90 Failed 90/90 tests, 0.00% okay t/akmisc...........dubious Test returned status 0 (wstat 139, 0x8b) test program seems to have generated a core DIED. FAILED tests 1-351 Failed 351/351 tests, 0.00% okay t/dbdadmin.........dubious Test returned status 0 (wstat 139, 0x8b) test program seems to have generated a core DIED. FAILED tests 1-21 Failed 21/21 tests, 0.00% okay t/insertid.........dubious Test returned status 0 (wstat 139, 0x8b) test program seems to have generated a core t/mysql............dubious Test returned status 0 (wstat 139, 0x8b) test program seems to have generated a core t/mysql2...........dubious Test returned status 0 (wstat 139, 0x8b) test program seems to have generated a core Failed Test Stat Wstat Total Fail Failed List of Failed ------------------------------------------------------------------------------- t/10dsnlist.t 0 139 ?? ?? % ?? t/20createdrop.t 0 139 ?? ?? % ?? t/30insertfetch.t 0 139 ?? ?? % ?? t/40bindparam.t 0 139 ?? ?? % ?? t/40blobs.t 0 139 ?? ?? % ?? t/40listfields.t 0 139 ?? ?? % ?? t/40nulls.t 0 139 ?? ?? % ?? t/40numrows.t 0 139 ?? ?? % ?? t/50chopblanks.t 0 139 ?? ?? % ?? t/50commit.t 0 139 ?? ?? % ?? t/ak-dbd.t 0 139 90 180 200.00% 1-90 t/akmisc.t 0 139 351 702 200.00% 1-351 t/dbdadmin.t 0 139 21 42 200.00% 1-21 t/insertid.t 0 139 ?? ?? % ?? t/mysql.t 0 139 ?? ?? % ?? t/mysql2.t 0 139 ?? ?? % ?? 1 test skipped. Failed 16/18 test scripts, 11.11% okay. 462/467 subtests failed, 1.07% okay. make: *** [test_dynamic] Error 2 Here are some additional environment details: $ uname -a SunOS hw-develop 5.8 Generic_117350-10 sun4u sparc $ perl -V Summary of my perl5 (revision 5 version 8 subversion 5) configuration: Platform: osname=solaris, osvers=2.8, archname=sun4-solaris-thread-multi-64int uname='sunos hw-develop 5.8 generic_108528-29 sun4u sparc ' config_args='' hint=recommended, useposix=true, d_sigaction=define usethreads=define use5005threads=undef useithreads=define usemultiplicity=define useperlio=define d_sfio=undef uselargefiles=define usesocks=undef use64bitint=define use64bitall=undef uselongdouble=undef usemymalloc=n, bincompat5005=undef Compiler: cc='gcc', ccflags ='-D_REENTRANT -fno-strict-aliasing -pipe -I/usr/local/include -D_LARGEFILE_SOURCE -D_FILE_OFFSET_BITS=64', optimize='-O', cppflags='-D_REENTRANT -fno-strict-aliasing -pipe -I/usr/local/include' ccversion='', gccversion='3.4.1', gccosandvers='solaris2.8' intsize=4, longsize=4, ptrsize=4, doublesize=8, byteorder=87654321 d_longlong=define, longlongsize=8, d_longdbl=define, longdblsize=16 ivtype='long long', ivsize=8, nvtype='double', nvsize=8, Off_t='off_t', lseeksize=8 alignbytes=8, prototype=define Linker and Libraries: ld='gcc', ldflags =' -L/usr/local/lib ' libpth=/usr/local/lib /usr/lib /usr/ccs/lib libs=-lsocket -lnsl -ldb -ldl -lm -lpthread -lc perllibs=-lsocket -lnsl -ldl -lm -lpthread -lc libc=/lib/libc.so, so=so, useshrplib=false, libperl=libperl.a gnulibc_version='' Dynamic Linking: dlsrc=dl_dlopen.xs, dlext=so, d_dlsymun=undef, ccdlflags=' -Wl,-E' cccdlflags='-fPIC', lddlflags=' -Wl,-E -G -L/usr/local/lib' Characteristics of this binary (from libperl): Compile-time options: MULTIPLICITY USE_ITHREADS USE_64_BIT_INT USE_LARGE_FILES PERL_IMPLICIT_CONTEXT Built under solaris Compiled at Aug 11 2004 14:17:35 @INC: /opt/apps/perl-5.8.5/lib/5.8.5/sun4-solaris-thread-multi-64int /opt/apps/perl-5.8.5/lib/5.8.5 /opt/lib/site_perl/5.8.5/sun4-solaris-thread-multi-64int /opt/lib/site_perl/5.8.5 /opt/lib/site_perl . $ gcc -v Reading specs from /opt/apps/gcc-3.4.2/lib/gcc/sparc-sun-solaris2.8/3.4.2/specs Configured with: ../gcc-3.4.2/configure --prefix=/opt/apps/gcc-3.4.2 --mandir=/opt/man --with-as=/opt/bin/as --with-ld=/opt/bin/ld --with-gnu-as --with-gnu-ld --enable-languages=c,c++,objc Thread model: posix gcc version 3.4.2
MIME-Version: 1.0
X-Mailer: MIME-tools 5.418 (Entity 5.418)
Content-Disposition: inline
Message-Id: <rt-3.5.HEAD-9541-1139495479-693.8207-0-0 [...] rt.cpan.org>
Content-Type: text/plain; charset="utf8"
Content-Transfer-Encoding: binary
From: otheus [...] dps.uibk.ac.at
X-RT-Original-Encoding: utf-8
X-RT-Original-Encoding: utf-8
Content-Length: 124
Download (untitled) / with headers
text/plain 124b
I got the same thing. gcc 3.4.4, mysql 4.0.16, DBD-3.0002, perl 5.8.7 (stable release), Solaris 5.9. Help much appreciated.
MIME-Version: 1.0
X-Mailer: MIME-tools 5.418 (Entity 5.418)
Content-Disposition: inline
Message-Id: <rt-3.6.HEAD-15931-1159827132-768.8207-0-0 [...] rt.cpan.org>
Content-Type: text/plain; charset="utf8"
Content-Transfer-Encoding: binary
X-RT-Original-Encoding: utf-8
X-RT-Original-Encoding: utf-8
Content-Length: 6693
Download (untitled) / with headers
text/plain 6.5k
I'm curious what the latest 3.0007 release would give. Kind regards, Patrick On Mon Nov 01 18:28:27 2004, guest wrote: Show quoted text
> I am testing MySQL 4.1.x. The installation works with all of my > applications execpt the DBD-Mysql. When I attempt to install the > module, the compile is clean, but "make test" reports the following: > > $ make test > PERL_DL_NONLAZY=1 /opt/bin/perl "-MExtUtils::Command::MM" "-e" > "test_harness(0, 'blib/lib', 'blib/arch')" t/*.t > t/00base...........ok > t/10dsnlist........dubious > Test returned status 0 (wstat 139, 0x8b) > test program seems to have generated a core > t/20createdrop.....dubious > Test returned status 0 (wstat 139, 0x8b) > test program seems to have generated a core > t/30insertfetch....dubious > Test returned status 0 (wstat 139, 0x8b) > test program seems to have generated a core > t/40bindparam......dubious > Test returned status 0 (wstat 139, 0x8b) > test program seems to have generated a core > t/40blobs..........dubious > Test returned status 0 (wstat 139, 0x8b) > test program seems to have generated a core > t/40listfields.....dubious > Test returned status 0 (wstat 139, 0x8b) > test program seems to have generated a core > t/40nulls..........dubious > Test returned status 0 (wstat 139, 0x8b) > test program seems to have generated a core > t/40numrows........dubious > Test returned status 0 (wstat 139, 0x8b) > test program seems to have generated a core > t/50chopblanks.....dubious > Test returned status 0 (wstat 139, 0x8b) > test program seems to have generated a core > t/50commit.........dubious > Test returned status 0 (wstat 139, 0x8b) > test program seems to have generated a core > t/60leaks..........skipped > all skipped: $ENV{SLOW_TESTS} is not set or Proc::ProcessTable > not installed > t/ak-dbd...........dubious > Test returned status 0 (wstat 139, 0x8b) > test program seems to have generated a core > DIED. FAILED tests 1-90 > Failed 90/90 tests, 0.00% okay > t/akmisc...........dubious > Test returned status 0 (wstat 139, 0x8b) > test program seems to have generated a core > DIED. FAILED tests 1-351 > Failed 351/351 tests, 0.00% okay > t/dbdadmin.........dubious > Test returned status 0 (wstat 139, 0x8b) > test program seems to have generated a core > DIED. FAILED tests 1-21 > Failed 21/21 tests, 0.00% okay > t/insertid.........dubious > Test returned status 0 (wstat 139, 0x8b) > test program seems to have generated a core > t/mysql............dubious > Test returned status 0 (wstat 139, 0x8b) > test program seems to have generated a core > t/mysql2...........dubious > Test returned status 0 (wstat 139, 0x8b) > test program seems to have generated a core > Failed Test Stat Wstat Total Fail Failed List of Failed >
------------------------------------------------------------------------------- Show quoted text
> t/10dsnlist.t 0 139 ?? ?? % ?? > t/20createdrop.t 0 139 ?? ?? % ?? > t/30insertfetch.t 0 139 ?? ?? % ?? > t/40bindparam.t 0 139 ?? ?? % ?? > t/40blobs.t 0 139 ?? ?? % ?? > t/40listfields.t 0 139 ?? ?? % ?? > t/40nulls.t 0 139 ?? ?? % ?? > t/40numrows.t 0 139 ?? ?? % ?? > t/50chopblanks.t 0 139 ?? ?? % ?? > t/50commit.t 0 139 ?? ?? % ?? > t/ak-dbd.t 0 139 90 180 200.00% 1-90 > t/akmisc.t 0 139 351 702 200.00% 1-351 > t/dbdadmin.t 0 139 21 42 200.00% 1-21 > t/insertid.t 0 139 ?? ?? % ?? > t/mysql.t 0 139 ?? ?? % ?? > t/mysql2.t 0 139 ?? ?? % ?? > 1 test skipped. > Failed 16/18 test scripts, 11.11% okay. 462/467 subtests failed, 1.07% > okay. > make: *** [test_dynamic] Error 2 > > Here are some additional environment details: > > $ uname -a > SunOS hw-develop 5.8 Generic_117350-10 sun4u sparc > > $ perl -V > Summary of my perl5 (revision 5 version 8 subversion 5) configuration: > Platform: > osname=solaris, osvers=2.8, archname=sun4-solaris-thread-multi- > 64int > uname='sunos hw-develop 5.8 generic_108528-29 sun4u sparc ' > config_args='' > hint=recommended, useposix=true, d_sigaction=define > usethreads=define use5005threads=undef useithreads=define > usemultiplicity=define > useperlio=define d_sfio=undef uselargefiles=define usesocks=undef > use64bitint=define use64bitall=undef uselongdouble=undef > usemymalloc=n, bincompat5005=undef > Compiler: > cc='gcc', ccflags ='-D_REENTRANT -fno-strict-aliasing -pipe > -I/usr/local/include -D_LARGEFILE_SOURCE -D_FILE_OFFSET_BITS=64', > optimize='-O', > cppflags='-D_REENTRANT -fno-strict-aliasing -pipe > -I/usr/local/include' > ccversion='', gccversion='3.4.1', gccosandvers='solaris2.8' > intsize=4, longsize=4, ptrsize=4, doublesize=8, byteorder=87654321 > d_longlong=define, longlongsize=8, d_longdbl=define, > longdblsize=16 > ivtype='long long', ivsize=8, nvtype='double', nvsize=8, > Off_t='off_t', lseeksize=8 > alignbytes=8, prototype=define > Linker and Libraries: > ld='gcc', ldflags =' -L/usr/local/lib ' > libpth=/usr/local/lib /usr/lib /usr/ccs/lib > libs=-lsocket -lnsl -ldb -ldl -lm -lpthread -lc > perllibs=-lsocket -lnsl -ldl -lm -lpthread -lc > libc=/lib/libc.so, so=so, useshrplib=false, libperl=libperl.a > gnulibc_version='' > Dynamic Linking: > dlsrc=dl_dlopen.xs, dlext=so, d_dlsymun=undef, ccdlflags=' -Wl,-E' > cccdlflags='-fPIC', lddlflags=' -Wl,-E -G -L/usr/local/lib' > > > Characteristics of this binary (from libperl): > Compile-time options: MULTIPLICITY USE_ITHREADS USE_64_BIT_INT > USE_LARGE_FILES PERL_IMPLICIT_CONTEXT > Built under solaris > Compiled at Aug 11 2004 14:17:35 > @INC: > /opt/apps/perl-5.8.5/lib/5.8.5/sun4-solaris-thread-multi-64int > /opt/apps/perl-5.8.5/lib/5.8.5 > /opt/lib/site_perl/5.8.5/sun4-solaris-thread-multi-64int > /opt/lib/site_perl/5.8.5 > /opt/lib/site_perl > . > > $ gcc -v > Reading specs from /opt/apps/gcc-3.4.2/lib/gcc/sparc-sun- > solaris2.8/3.4.2/specs > Configured with: ../gcc-3.4.2/configure --prefix=/opt/apps/gcc-3.4.2 > --mandir=/opt/man --with-as=/opt/bin/as --with-ld=/opt/bin/ld > --with-gnu-as --with-gnu-ld --enable-languages=c,c++,objc > Thread model: posix > gcc version 3.4.2
MIME-Version: 1.0
X-Spam-Status: No, hits=-1.1 required=8.0 tests=BAYES_05
In-Reply-To: <rt-3.6.HEAD-15931-1159827132-768.8207-6-0 [...] rt.cpan.org>
Received-SPF: pass (x1.develooper.com: local policy)
References: <RT-Ticket-8207 [...] rt.cpan.org> <rt-3.6.HEAD-15931-1159827132-768.8207-6-0 [...] rt.cpan.org>
Content-Type: text/plain; charset=UTF-8; format=flowed
X-Virus-Scanned: by amavisd-milter (http://www.amavis.org/)
X-RT-Original-Encoding: utf-8
Received: from la.mx.develooper.com (x1.develooper.com [63.251.223.170]) by diesel.bestpractical.com (Postfix) with SMTP id 83BFF4D811F for <bug-DBD-mysql [...] rt.cpan.org>; Mon, 2 Oct 2006 18:18:16 -0400 (EDT)
Received: (qmail 6483 invoked by alias); 2 Oct 2006 22:18:15 -0000
Received: from lifesci.ucsb.edu (HELO lifesci.lifesci.ucsb.edu) (128.111.226.5) by la.mx.develooper.com (qpsmtpd/0.28) with ESMTP; Mon, 02 Oct 2006 15:18:14 -0700
Received: from [128.111.226.63] (enterprise.lifesci.ucsb.edu [128.111.226.63]) (authenticated bits=0) by lifesci.lifesci.ucsb.edu (8.13.6/8.13.3) with ESMTP id k92MI6n9021870 (version=TLSv1/SSLv3 cipher=DHE-RSA-AES256-SHA bits=256 verify=NOT) for <bug-DBD-mysql [...] rt.cpan.org>; Mon, 2 Oct 2006 15:18:06 -0700 (PDT)
Delivered-To: cpan-bug+dbd-mysql [...] diesel.bestpractical.com
Subject: Re: [rt.cpan.org #8207] Module dumps core under Solaris 2.8
User-Agent: Thunderbird 1.5.0.7 (X11/20060911)
Return-Path: <lovan [...] lifesci.ucsb.edu>
X-Spam-Check-BY: la.mx.develooper.com
X-Original-To: bug-DBD-mysql [...] rt.cpan.org
Date: Mon, 02 Oct 2006 15:18:05 -0700
Message-Id: <4521901D.5020603 [...] lifesci.ucsb.edu>
To: bug-DBD-mysql [...] rt.cpan.org
Content-Transfer-Encoding: 7bit
From: Shea Lovan <lovan [...] lifesci.ucsb.edu>
X-RT-Original-Encoding: utf-8
RT-Message-ID: <rt-3.6.HEAD-15878-1159827502-78.8207-0-0 [...] rt.cpan.org>
Content-Length: 310
Download (untitled) / with headers
text/plain 310b
I'm not in a position to test it. In the two years since I posted the original bug, all of our servers have moved to Solaris 10 and MySQL 5.0.x. -Shea Lovan -- ------------------------ Shea A. Lovan Manager, IT Operations UCSB Biological Sciences Santa Barbara, CA 93106 805.893.5294 fax: 805.893.4724
MIME-Version: 1.0
X-Mailer: MIME-tools 5.418 (Entity 5.418)
Content-Disposition: inline
Message-Id: <rt-3.6.HEAD-378-1167361998-1020.8207-0-0 [...] rt.cpan.org>
Content-Type: text/plain; charset="utf8"
Content-Transfer-Encoding: binary
X-RT-Original-Encoding: utf-8
X-RT-Original-Encoding: utf-8
Content-Length: 149
Download (untitled) / with headers
text/plain 149b
I'm going to close this bug, since involves old versions of just about everything. Thanks for the report, and sorry it wasn't more clearly resolved.


This service is sponsored and maintained by Best Practical Solutions and runs on Perl.org infrastructure.

Please report any issues with rt.cpan.org to rt-cpan-admin@bestpractical.com.