Skip Menu |
 

This queue is for tickets about the Devel-Declare CPAN distribution.

Report information
The Basics
Id: 46989
Status: resolved
Priority: 0/
Queue: Devel-Declare

People
Owner: Nobody in particular
Requestors: tomas.znamenacek [...] gmail.com
Cc:
AdminCc:

Bug Information
Severity: (no value)
Broken in: (no value)
Fixed in: (no value)



MIME-Version: 1.0 (Apple Message framework v935.3)
X-Spam-Status: No, hits=0.0 required=8.0 tests=DK_SIGNED,SPF_PASS
X-Mailer: Apple Mail (2.935.3)
content-type: text/plain; charset="utf-8"; delsp="yes"; format="flowed"
Message-ID: <260999F3-6B7F-46A3-9549-DE562702E0A2 [...] gmail.com>
Received: from la.mx.develooper.com (x1.develooper.com [207.171.7.70]) by diesel.bestpractical.com (Postfix) with SMTP id 99C264D80D7 for <bug-Devel-Declare [...] rt.cpan.org>; Tue, 16 Jun 2009 00:59:31 -0400 (EDT)
Received: (qmail 8747 invoked by uid 103); 16 Jun 2009 04:59:31 -0000
Received: from x16.dev (10.0.100.26) by x1.dev with QMQP; 16 Jun 2009 04:59:31 -0000
Received: from mail-bw0-f211.google.com (HELO mail-bw0-f211.google.com) (209.85.218.211) by 16.mx.develooper.com (qpsmtpd/0.80) with ESMTP; Mon, 15 Jun 2009 21:59:25 -0700
Received: by bwz7 with SMTP id 7so55982bwz.45 for <bug-Devel-Declare [...] rt.cpan.org>; Mon, 15 Jun 2009 21:59:21 -0700 (PDT)
Received: by 10.204.58.16 with SMTP id e16mr7811159bkh.43.1245128361716; Mon, 15 Jun 2009 21:59:21 -0700 (PDT)
Received: from ?192.168.1.100? (190.77.broadband6.iol.cz [88.101.77.190]) by mx.google.com with ESMTPS id 1sm9495560fks.11.2009.06.15.21.59.20 (version=TLSv1/SSLv3 cipher=RC4-MD5); Mon, 15 Jun 2009 21:59:21 -0700 (PDT)
Delivered-To: cpan-bug+Devel-Declare [...] diesel.bestpractical.com
Subject: Won’t compile on OS X 10.5.7
Return-Path: <tomas.znamenacek [...] gmail.com>
Domainkey-Signature: a=rsa-sha1; c=nofws; d=gmail.com; s=gamma; h=message-id:from:to:content-type:content-transfer-encoding :mime-version:subject:date:x-mailer; b=XYMmRLh+Q+Rk3SnvD7JAYOGuYrthP39KzxEcvzJ2mlKW6nPtAUpU/QjmM+tRtAhpd0 HKj1FK2RjpaK7Ez9Semk0q9ptz0rm1B5E9QwQYC/BVm+oxJbuczVDdDwTK+/qXjoI4dO /mkUQSX5l4FSd2uOySwo5lRx2qfmEmbG7fvJQ=
X-Original-To: bug-Devel-Declare [...] rt.cpan.org
X-Spam-Check-BY: 16.mx.develooper.com
Dkim-Signature: v=1; a=rsa-sha256; c=relaxed/relaxed; d=gmail.com; s=gamma; h=domainkey-signature:received:received:message-id:from:to :content-type:content-transfer-encoding:mime-version:subject:date :x-mailer; bh=nwlhkRdyYOXvwnEEPWxq5uOiJ8czGpiL3zFJdQInt/Q=; b=lYR+RMxwQyAMhhL0ZOI/fsr3MFr5PS6nESbSI39tpdRlolZy6dvoIjDRoDDRuNknxu g2N/ZoLbb0xQg0TiikhIH0Jlwqcw2UOKuztY2tpS1cR510h1ZqeUIboDX+nfxH3u7Gfa L+JllCNBYgYkdpzag6U4WgNMN5U+YlIuUOSzM=
Date: Tue, 16 Jun 2009 06:59:20 +0200
X-Spam-Level: *
To: bug-Devel-Declare [...] rt.cpan.org
Content-Transfer-Encoding: quoted-printable
From: Tomáš Znamenáček <tomas.znamenacek [...] gmail.com>
X-RT-Original-Encoding: WINDOWS-1252
Content-Length: 2104
Hello, the Devel::Declare module does not compile on my Mac: zoul@naima:Devel-Declare-0.005005$ perl Makefile.PL Checking if your kit is complete... Looks good Writing Makefile for Devel::Declare zoul@naima:Devel-Declare-0.005005$ make cp lib/Devel/Declare/Context/Simple.pm blib/lib/Devel/Declare/Context/ Simple.pm cp lib/Devel/Declare.pm blib/lib/Devel/Declare.pm cp lib/Devel/Declare/MethodInstaller/Simple.pm blib/lib/Devel/Declare/ MethodInstaller/Simple.pm /usr/bin/perl "-Iinc" /Library/Perl/Updates/5.8.8/ExtUtils/xsubpp - typemap /System/Library/Perl/5.8.8/ExtUtils/typemap Declare.xs > Declare.xsc && mv Declare.xsc Declare.c cc -c -I/Library/Perl/5.8.8/darwin-thread-multi-2level/B/Hooks/OP/ Check/Install -arch ppc -arch i386 -g -pipe -fno-common -DPERL_DARWIN - no-cpp-precomp -fno-strict-aliasing -Wdeclaration-after-statement -I/ usr/local/include -O3 -DVERSION=\"0.005005\" -DXS_VERSION= \"0.005005\" "-I/System/Library/Perl/5.8.8/darwin-thread-multi-2level/ CORE" Declare.c In file included from Declare.xs:6: stolen_chunk_of_toke.c: In function ‘S_force_next’: stolen_chunk_of_toke.c:853: error: ‘dVAR’ undeclared (first use in this function) stolen_chunk_of_toke.c:853: error: (Each undeclared identifier is reported only once stolen_chunk_of_toke.c:853: error: for each function it appears in.) In file included from Declare.xs:6: stolen_chunk_of_toke.c: In function ‘S_force_next’: stolen_chunk_of_toke.c:853: error: ‘dVAR’ undeclared (first use in this function) stolen_chunk_of_toke.c:853: error: (Each undeclared identifier is reported only once stolen_chunk_of_toke.c:853: error: for each function it appears in.) lipo: can't open input file: /var/folders/G5/G5VuwVv8FLC-EuIgUCr35k++ +TM/-Tmp-//ccNrAIRR.out (No such file or directory) make: *** [Declare.o] Error 1 perl -v: This is perl, v5.8.8 built for darwin-thread-multi-2level (with 4 registered patches, see perl -V for more detail) uname -a: Darwin naima.local 9.7.0 Darwin Kernel Version 9.7.0: Tue Mar 31 22:52:17 PDT 2009; root:xnu-1228.12.14~1/RELEASE_I386 i386 T.


This service is sponsored and maintained by Best Practical Solutions and runs on Perl.org infrastructure.

Please report any issues with rt.cpan.org to rt-cpan-admin@bestpractical.com.