Skip Menu |
 

Preferred bug tracker

Please visit the preferred bug tracker to report your issue.

This queue is for tickets about the Test-WWW-Mechanize CPAN distribution.

Report information
The Basics
Id: 17156
Status: resolved
Priority: 0/
Queue: Test-WWW-Mechanize

People
Owner: Nobody in particular
Requestors: lee.goddard [...] easa.eu.int
Cc:
AdminCc:

Bug Information
Severity: Critical
Broken in: 1.08
Fixed in: (no value)



Subject: Will not install on RedHat perl 5.9.2
MIME-Version: 1.0
X-Mailer: MIME-tools 5.418 (Entity 5.418)
Content-Type: text/plain; charset="utf8"
Content-Disposition: inline
Content-Transfer-Encoding: binary
X-RT-Original-Encoding: utf-8
Content-Length: 5729
Download (untitled) / with headers
text/plain 5.5k
CPAN.pm: Going to build P/PE/PETDANCE/Test-WWW-Mechanize-1.08.tar.gz Checking if your kit is complete... Looks good Writing Makefile for Test::WWW::Mechanize cp Mechanize.pm blib/lib/Test/WWW/Mechanize.pm Manifying blib/man3/Test::WWW::Mechanize.3 /usr/bin/make -- OK Running make test PERL_DL_NONLAZY=1 /usr/local/bin/perl "-MExtUtils::Command::MM" "- e" "test_harness(0, 'blib/lib', 'blib/arch')" t/*.t t/00load................# Testing Test::WWW::Mechanize 1.08, Perl 5.008007, /usr/local/bin/perl t/00load................ok t/content_contains......ok t/content_lacks.........ok t/follow_link_ok........ok 1/6 # Failed test 'Go after first link' # in t/follow_link_ok.t at line 28. # No matching link found t/follow_link_ok........FAILED test 4 Failed 1/6 tests, 83.33% okay t/get_ok-parms..........ok t/get_ok................ok t/has_tag...............ok t/link_content..........ok 1/9 # Failed test 'Handles link content not found' # in t/link_content.t at line 46. # STDOUT is: # ok 1 - Checking all page link content failures # # not: # not ok 1 - Checking all page link content failures # # as expected # STDERR is: # # not: # (?-xism:#\s+Failed\ test.*?\n?.*?t\/link_content\.t at line 45.*\n?) # # goodlinks.html # # # badlinks.html # # # goodlinks.html # # as expected # Failed test 'Handles link unlike content found' # in t/link_content.t at line 66. # STDOUT is: # ok 1 - Checking all page link unlike content failures # # not: # not ok 1 - Checking all page link unlike content failures # # as expected # STDERR is: # # not: # (?-xism:#\s+Failed\ test.*?\n?.*?t\/link_content\.t at line 65.*\n?) # # goodlinks.html # # # badlinks.html # # # goodlinks.html # # as expected t/link_content..........FAILED tests 6, 9 Failed 2/9 tests, 77.78% okay t/link_status...........ok t/links_ok..............ok t/new...................ok t/page_links_content....ok 1/9 # Failed test 'Handles link content not found' # in t/page_links_content.t at line 45. # STDOUT is: # ok 1 - Checking all page link content failures # # not: # not ok 1 - Checking all page link content failures # # as expected # STDERR is: # # not: # (?-xism:#\s+Failed\ test.*?\n?.*?t\/page_links_content\.t at line 44.*\n?) # # goodlinks.html # # # badlinks.html # # # goodlinks.html # # as expected # Failed test 'Handles link unlike content found' # in t/page_links_content.t at line 65. # STDOUT is: # ok 1 - Checking all page link unlike content failures # # not: # not ok 1 - Checking all page link unlike content failures # # as expected # STDERR is: # # not: # (?-xism:#\s+Failed\ test.*?\n?.*?t\/page_links_content\.t at line 64.*\n?) # # goodlinks.html # # # badlinks.html # # # goodlinks.html # # as expected t/page_links_content....FAILED tests 6, 9 Failed 2/9 tests, 77.78% okay t/page_links_ok.........ok t/pod-coverage..........skipped all skipped: Test::Pod::Coverage 0.08 required for testing POD coverage t/pod...................ok t/stuff_inputs..........ok Failed Test Stat Wstat Total Fail Failed List of Failed ----------------------------------------------------------------------- -------- t/follow_link_ok.t 6 1 16.67% 4 t/link_content.t 9 2 22.22% 6 9 t/page_links_content.t 9 2 22.22% 6 9 1 test skipped. Failed 3/16 test scripts, 81.25% okay. 5/101 subtests failed, 95.05% okay. make: *** [test_dynamic] Error 255 /usr/bin/make test -- NOT OK Running make install make test had returned bad status, won't install without force Show quoted text
cpan>exit
$ perl -V Summary of my perl5 (revision 5 version 8 subversion 7) configuration: Platform: osname=linux, osvers=2.4.21-32.0.1.el, archname=i686-linux uname='linux dave11 2.4.21-32.0.1.el #1 tue may 17 18:01:37 edt 2005 i686 i686 i386 gnulinux ' config_args='' hint=recommended, useposix=true, d_sigaction=define usethreads=undef use5005threads=undef useithreads=undef usemultiplicity=undef useperlio=define d_sfio=undef uselargefiles=undef usesocks=undef use64bitint=undef use64bitall=undef uselongdouble=undef usemymalloc=n, bincompat5005=undef Compiler: cc='cc', ccflags ='-fno-strict-aliasing -pipe - I/usr/local/include -I/usr/include/gdbm', optimize='-O2', cppflags='-fno-strict-aliasing -pipe -I/usr/local/include - I/usr/include/gdbm' ccversion='', gccversion='2.96 20000731 (Red Hat Linux 7.3 2.96- 122)', gccosandvers='linux7' intsize=4, longsize=4, ptrsize=4, doublesize=8, byteorder=1234 d_longlong=define, longlongsize=8, d_longdbl=define, longdblsize=12 ivtype='long', ivsize=4, nvtype='double', nvsize=8, Off_t='off_t', lseeksize=4 alignbytes=4, prototype=define Linker and Libraries: ld='cc', ldflags =' -L/usr/local/lib' libpth=/usr/local/lib /lib /usr/lib libs=-lnsl -lgdbm -ldb -ldl -lm -lcrypt -lutil -lc perllibs=-lnsl -ldl -lm -lcrypt -lutil -lc libc=/lib/libc-2.3.2.so, so=so, useshrplib=true, libperl=libperl.so gnulibc_version='2.3.2' Dynamic Linking: dlsrc=dl_dlopen.xs, dlext=so, d_dlsymun=undef, ccdlflags='-Wl,-E - Wl,-rpath,/usr/local/lib/perl5/5.8.7/CORE' cccdlflags='-fpic', lddlflags='-shared -L/usr/local/lib' Characteristics of this binary (from libperl): Compile-time options: Built under linux Compiled at Sep 16 2005 11:04:03 %ENV: PERL="/usr/local/bin/perl" PERL5LIB="/usr/local/lib/perl5/site_perl/5.8.7/" PERL5LIBOLD="/usr/lib/perl5/site_perl/5.8.0/" @INC: /usr/local/lib/perl5/site_perl/5.8.7/ /usr/local/lib/perl5/5.8.7 /usr/local/lib/perl5/5.8.7 /usr/local/lib/perl5/site_perl/5.8.7 /usr/local/lib/perl5/site_perl . [root@dave11 rt-3.4.4]#
X-Scanned-BY: AMaViS-ng at bestpractical
MIME-Version: 1.0
X-Spam-Status: No, hits=-2.4 required=8.0 tests=BAYES_00,DNS_FROM_RFC_ABUSE
Content-Class: urn:content-classes:message
Received-SPF: pass (x1.develooper.com: local policy)
Content-Type: text/plain; charset="utf-8"
X-MS-Tnef-Correlator:
X-RT-Original-Encoding: us-ascii
Received: from localhost (localhost.localdomain [127.0.0.1]) by diesel.bestpractical.com (Postfix) with ESMTP id A5ED04D82AB for <cpan-bug+test-www-mechanize [...] diesel.bestpractical.com>; Thu, 19 Jan 2006 09:12:02 -0500 (EST)
Received: from la.mx.develooper.com (x1.develooper.com [63.251.223.170]) by diesel.bestpractical.com (Postfix) with SMTP id B94444D82A3 for <bug-Test-WWW-Mechanize [...] rt.cpan.org>; Thu, 19 Jan 2006 09:12:01 -0500 (EST)
Received: (qmail 20083 invoked by alias); 19 Jan 2006 14:11:30 -0000
Received: from Unknown (HELO bleriot.easa.local) (62.156.141.114) by la.mx.develooper.com (qpsmtpd/0.28) with ESMTP; Thu, 19 Jan 2006 06:11:24 -0800
Delivered-To: cpan-bug+test-www-mechanize [...] diesel.bestpractical.com
Subject: RE: [rt.cpan.org #17156] AutoReply: Will not install on RedHat perl 5.9.2
Return-Path: <lee.goddard [...] easa.eu.int>
X-Spam-Check-BY: la.mx.develooper.com
X-Original-To: cpan-bug+test-www-mechanize [...] diesel.bestpractical.com
Thread-Index: AcYdAksMJc0nmsp7TrWTt7so5NUm4gAACdow
Date: Thu, 19 Jan 2006 15:13:03 +0100
X-MS-Has-Attach:
Thread-Topic: [rt.cpan.org #17156] AutoReply: Will not install on RedHat perl 5.9.2
Message-Id: <5E47282BEBB9CE4D9D2FF205A1E0BB88018467E1 [...] bleriot.easa.local>
X-Mimeole: Produced By Microsoft Exchange V6.5.6944.0
To: <bug-Test-WWW-Mechanize [...] rt.cpan.org>
Content-Transfer-Encoding: quoted-printable
From: "Goddard Lee" <lee.goddard [...] easa.eu.int>
X-RT-Original-Encoding: utf-8
RT-Message-ID: <rt-3.5.HEAD-22160-1137679926-1993.17156-0-0 [...] rt.cpan.org>
Content-Length: 117
Download (untitled) / with headers
text/plain 117b
CORRECTION this is perl 587, as you'd see from perl -V I encluded. Perl 5.9.2 is the window next to it... Sorry....
MIME-Version: 1.0
X-Mailer: MIME-tools 5.418 (Entity 5.418)
Content-Disposition: inline
Message-Id: <rt-3.6.HEAD-23317-1178918667-654.17156-0-0 [...] rt.cpan.org>
Content-Type: text/plain; charset="utf8"
Content-Transfer-Encoding: binary
X-RT-Original-Encoding: utf-8
X-RT-Original-Encoding: utf-8
Content-Length: 29
This should be fixed on 1.14.


This service is sponsored and maintained by Best Practical Solutions and runs on Perl.org infrastructure.

Please report any issues with rt.cpan.org to rt-cpan-admin@bestpractical.com.